program: Gaussian 09
title: 000122083
version: EM64L-G09RevD.01
frameworkgroup: C1[X(C10H23N3O2)]
method: RPBEPBE
basis: SDD
operation: Freq
keyword: #p
keyword: freq=noraman
keyword: PBEPBE/SDD
title: #p freq=noraman PBEPBE/SDD
converged: YES YES NO NO
title: Mulliken charges:
elementType: O O N N N C C C C C C C C C C H H H H H H H H H H H H H H H H H H H H H H H
charge: -0.413795 -0.242722 -0.274856 -0.652453 -0.571656 -0.359278 -0.388295 -0.365381 -0.375645 -0.363683 -0.382526 -0.164650 -0.344700 -0.388322 0.147900 0.194182 0.226429 0.175592 0.214113 0.205892 0.215008 0.174065 0.210173 0.208177 0.171759 0.173673 0.213405 0.247762 0.232254 0.176412 0.215749 0.207725 0.175116 0.277741 0.314840 0.272014 0.257588 0.380393
chargesum: 0.00000
title: Mulliken charges with hydrogens summed into heavy atoms:
elementType: O O N N N C C C C C C C C C C
charge: -0.033401 -0.242722 -0.042602 -0.059872 -0.042054 0.061333 0.001410 0.055518 0.008593 0.016252 0.004552 0.083113 0.047461 -0.005481 0.147900
polarizability: 1.69967781e+02 1.59056692e+00 1.22286256e+02 2.58171125e+00 2.40283553e+00 1.21918298e+02
1716.lowfreq: -16.5995 -5.6360 -1.5722 -0.0005 -0.0002 0.0010 13.3763 20.2021 31.1884
frequency: 7.6783 19.5920 31.1702 44.3520 49.1695 68.4447 77.9219 94.1123 117.1124 122.1614 137.1377 155.7025 158.7093 184.8629 207.1172 229.5411 250.4610 276.2286 326.5182 344.9740 396.4597 439.3320 467.6138 474.0935 509.1128 527.8670 565.9617 602.6576 630.1153 680.5848 715.3543 740.5486 747.1868 783.1393 798.8047 805.3810 899.6297 912.6588 934.3144 960.7616 1007.9867 1019.1380 1038.0202 1052.1594 1060.9743 1065.2010 1077.1416 1080.3926 1102.2814 1108.5906 1127.5541 1145.3448 1152.6197 1183.2782 1194.5120 1208.8654 1228.9754 1246.5709 1253.1820 1262.3771 1272.3324 1275.4667 1281.4996 1285.6039 1289.4568 1293.2132 1319.4127 1335.0624 1355.3605 1364.1824 1380.9447 1386.0744 1390.6164 1447.8325 1455.0248 1465.0367 1466.4505 1471.6000 1478.6877 1488.3140 1492.8790 1498.0807 1603.9416 1637.9787 1663.2481 2832.5643 2841.9170 2859.7445 2888.8889 2951.7508 2953.5887 2958.2020 2962.9996 2986.7076 2991.5605 2993.9906 3009.0439 3017.1552 3022.2534 3036.5179 3049.0980 3057.4678 3412.3352 3451.2870 3505.4236 3519.1615 3579.1515 3650.8789
redmass: 2.1583 3.2970 5.0566 5.8073 4.7586 1.7290 3.7589 3.1334 2.0302 2.9581 2.6393 2.2393 2.6049 1.1581 3.5111 1.5139 2.1390 3.6210 3.2669 3.2913 3.6738 3.5691 1.5956 2.7836 2.7321 2.2394 3.3849 1.2931 1.4928 1.3069 4.2348 1.0947 1.0720 1.4103 1.2206 2.2833 1.5054 1.3602 2.0517 2.0581 3.3902 2.8726 2.6660 2.3240 2.2526 2.1861 2.1260 2.0516 2.9332 1.6078 1.6597 3.6539 1.3418 1.7229 1.6839 1.5608 1.5107 1.2705 1.3027 1.4099 1.3817 1.1317 1.1109 1.1980 1.1415 1.2119 1.2921 1.4021 1.4986 1.5642 1.8356 1.4968 1.4866 1.2165 1.0963 1.0680 1.0700 1.0831 1.0924 1.0941 1.0907 1.0870 1.3493 1.0944 3.5762 1.0716 1.0712 1.0717 1.0804 1.0642 1.0646 1.0656 1.0632 1.0617 1.0840 1.0832 1.0847 1.0935 1.0956 1.1005 1.1016 1.1034 1.0737 1.0448 1.0459 1.0641 1.0974 1.0997
irintensity: 2.2487 0.9763 0.8168 0.8981 0.3740 1.3149 0.2836 0.8593 2.0606 0.9883 2.7988 2.1053 0.6384 26.9615 0.5800 36.4508 14.9296 12.8104 11.1790 2.3918 15.9881 11.0891 125.7371 71.5026 82.2790 7.9303 5.6032 212.8595 187.0175 91.3953 16.3106 14.9128 9.9925 4.5231 0.3614 3.3411 2.9250 0.1171 1.2831 3.0229 3.6895 2.8533 29.0634 224.3892 5.4233 0.3873 3.9111 11.4233 2.4043 40.6463 2.4801 64.4559 5.7580 2.1439 2.8729 22.5903 3.7673 0.8455 1.3967 4.2982 11.1126 2.2740 1.6448 0.8761 2.1967 5.3254 10.9598 1.3309 14.6029 0.4286 5.4135 13.8889 2.9058 34.1947 2.4887 1.0562 0.7926 4.7498 8.1727 2.9612 4.4705 6.8705 179.9429 40.0986 133.0085 43.5078 177.4026 117.0422 54.4661 15.3433 33.0302 37.0293 21.3643 44.1013 6.8060 70.6377 37.0778 12.4003 1.2412 12.5258 112.1994 83.8470 2.9419 2.0906 13.1606 26.8713 0.1396 17.6508
temp: 298.150 k
press: 1.00000 atm
elementType: 8 8 7 7 7 6 6 6 6 6 6 6 6 6 6 1 1 1 1 1 1 1 1 1 1 1 1 1 1 1 1 1 1 1 1 1 1 1
symmnumber: 1
zpe: 873511.4 jmol-1
zpe.correction: 0.332703 hartree
zpe.thermalcorrener: 0.352398 hartree
zpe.thermalcorrenthalpy: 0.353342 hartree
zpe.thermalcorrgfe: 0.279926 hartree
zpe.sumelectzpe: -708.292785 hartree
zpe.sumelectthermal: -708.273090 hartree
zpe.sumelectthermalent: -708.272146 hartree
zpe.sumelectthermalfe: -708.345562 hartree
dipole: 0.3196 0.8077 -2.6879
dipole: 2.8247
quadrupole: -81.4065 -86.1058 -98.5875
quadrupole: -10.1322 2.1963 -3.8013
quadrupole: 7.2935 2.5941 -9.8876 -10.1322 2.1963 -3.8013
hfenergy: -708.6254877 hartree
pointgroup: C01 [X(C10H23N3O2)]
dipole: 0.1320409 0.1580249 -1.092088 debye
polarizability: 169.9995484|1.2179615|122.9235758|2.5275368|2.2155225|121.2492107 unknown
InChI: InChI=1S/C10H23N3O2/c11-6-2-4-8-13-7-3-1-5-9(12)10(14)15/h9,13-14H,1-8,11-12H2
charge 0 multiplicity 1
38 atoms
O  4.888563 1.292194 -1.240854
O  5.331251 1.286538 1.036091
N  -1.808064 -0.364131 -0.374215
N  4.649658 -1.370401 1.282437
N  -8.019174 0.560842 0.376474
C  2.047108 -0.303993 0.006799
C  0.658586 -0.682962 -0.552515
C  3.196951 -1.00477 -0.742638
C  -0.493988 0.034219 0.176813
C  -2.973046 0.269731 0.2810
C  -4.297048 -0.226462 -0.331785
C  4.592912 -0.808568 -0.067101
C  -5.538365 0.415651 0.325375
C  -6.864304 -0.080675 -0.286021
C  4.969743 0.668988 0.009172
H  2.180226 0.796541 -0.054279
H  2.11166 -0.578338 1.077643
H  0.614938 -0.438172 -1.636139
H  0.500243 -1.776022 -0.469064
H  3.006091 -2.096003 -0.77374
H  3.255348 -0.647915 -1.788724
H  -0.323549 1.141969 0.134144
H  -0.476559 -0.243615 1.249946
H  -2.944389 0.003027 1.356647
H  -2.942009 1.390046 0.23222
H  -4.301247 -0.007424 -1.421742
H  -4.338384 -1.328598 -0.231628
H  5.345853 -1.262381 -0.756269
H  -1.838103 -0.225779 -1.395647
H  -5.48126 1.520912 0.222646
H  -5.555393 0.199809 1.411052
H  -6.944523 -1.17379 -0.128562
H  -6.828442 0.081625 -1.392936
H  4.857245 -2.365372 1.348724
H  5.088968 -0.77601 1.988397
H  -8.927984 0.152791 0.136974
H  -8.026312 1.582776 0.291484
H  5.155899 2.246223 -1.145579
