program: Gaussian 09
title: 000122047
version: EM64L-G09RevD.01
frameworkgroup: C1[X(C8H10N2O3)]
method: RPBEPBE
basis: SDD
operation: Freq
keyword: #p
keyword: freq=noraman
keyword: PBEPBE/SDD
title: #p freq=noraman PBEPBE/SDD
converged: YES YES NO NO
title: Mulliken charges:
elementType: O O O N N C C C C C C C C H H H H H H H H H H
charge: -0.413959 -0.231147 -0.426182 -0.548717 -0.025099 -0.517540 -0.216300 0.206261 -0.304407 0.176724 -0.270562 0.295106 -0.502150 0.242440 0.241115 0.263312 0.242645 0.285267 0.276921 0.259220 0.232721 0.374192 0.360140
chargesum: 0.00000
title: Mulliken charges with hydrogens summed into heavy atoms:
elementType: O O O N N C C C C C C C C
charge: -0.039767 -0.231147 -0.066042 0.013471 -0.025099 -0.033986 0.047012 0.206261 -0.061762 0.176724 -0.011342 0.295106 -0.269429
polarizability: 1.41355319e+02 1.55017357e+01 1.03676270e+02 1.30441123e+01 -1.28921046e+01 7.80587012e+01
1716.lowfreq: -10.3697 -0.0006 -0.0004 -0.0003 6.2548 8.0529 24.2372 46.9902 59.5271
frequency: 24.0044 46.8957 59.4408 75.1261 141.2561 220.2726 223.2416 254.7789 305.8052 316.8560 369.6965 378.2043 400.6245 420.3468 444.9231 508.7762 545.4019 591.9575 609.3126 631.9626 688.5224 714.5834 737.3984 768.7070 786.9990 832.2982 851.5283 877.4437 953.4465 966.6099 978.0680 997.9969 1039.0626 1099.4302 1119.3650 1143.4679 1144.9282 1196.1879 1238.7603 1246.5960 1258.4661 1294.0817 1320.8902 1322.5471 1331.9363 1370.5552 1394.1646 1457.2799 1472.0525 1572.6347 1596.7593 1650.8318 1657.2367 3012.6782 3053.4908 3085.1721 3087.9506 3142.6224 3174.4018 3437.8060 3499.9862 3561.1936 3574.2169
redmass: 5.2158 6.4238 6.5070 5.9269 5.8486 2.6152 1.8708 4.4003 2.5169 2.3448 2.3473 1.4511 3.1007 3.7056 4.8909 3.2743 3.9373 1.7571 1.9644 7.5634 1.5658 3.8960 3.7471 3.7518 4.8081 2.6816 2.2021 1.4564 1.9119 1.4188 2.9243 3.1636 2.4758 1.4707 2.0877 1.4384 1.3465 1.4052 1.9578 2.0140 2.1003 1.4961 1.8442 1.6265 2.9292 1.4287 2.3878 1.1090 2.8774 5.5624 6.4676 1.0906 8.4256 1.0594 1.0863 1.1028 1.0911 1.0903 1.0969 1.0453 1.0639 1.0965 1.0660
irintensity: 0.0687 0.0041 0.6141 2.3606 0.2477 14.9256 24.5773 8.6002 24.4182 11.5519 41.5560 117.6553 13.0898 8.2962 27.1715 12.5136 17.3074 86.4029 78.9162 2.4775 259.2180 29.0255 2.6652 11.6114 1.6604 11.8542 25.8986 8.1007 3.1605 2.3101 21.5426 7.0183 190.6735 16.0608 47.1911 45.7475 168.7788 6.2055 3.1648 0.2876 46.4044 2.4527 11.7183 6.7121 0.7553 5.1300 57.0196 8.5815 131.0687 1.6650 13.9226 34.8102 223.1473 14.1370 10.8873 12.3867 34.4562 9.2893 5.2678 1.3939 13.2276 3.7764 46.0426
temp: 298.150 k
press: 1.00000 atm
elementType: 8 8 8 7 7 6 6 6 6 6 6 6 6 1 1 1 1 1 1 1 1 1 1
symmnumber: 1
zpe: 462232.5 jmol-1
zpe.correction: 0.176055 hartree
zpe.thermalcorrener: 0.188746 hartree
zpe.thermalcorrenthalpy: 0.189690 hartree
zpe.thermalcorrgfe: 0.135589 hartree
zpe.sumelectzpe: -645.045102 hartree
zpe.sumelectthermal: -645.032411 hartree
zpe.sumelectthermalent: -645.031467 hartree
zpe.sumelectthermalfe: -645.085568 hartree
dipole: 1.4651 0.3630 1.4376
dipole: 2.0845
quadrupole: -71.6885 -69.8824 -77.8135
quadrupole: 8.4136 -7.2306 0.4743
quadrupole: 1.4396 3.2457 -4.6853 8.4136 -7.2306 0.4743
hfenergy: -645.2211568 hartree
pointgroup: C01 [X(C8H10N2O3)]
dipole: 0.5689627 -0.1583014 -0.5690062 debye
dipolederiv: -0.6268189 0.1298421 0.2786425 0.208264 -0.4260094 -0.3886653 0.2527352 -0.3194376 -0.7811036 -0.5864615 -0.0709137 0.2676581 -0.2783165 -0.6985052 0.1731784 0.300285 0.0221152 -0.6105525 -1.3993131 0.4083904 0.0702603 0.4289427 -0.3279184 -0.2162235 0.1267181 -0.2302275 -0.3172928 -0.6408603 0.1131881 0.0059046 0.2237247 -0.7673219 -0.0468615 -0.00068 -0.0738363 -0.1853469 -0.352297 -0.0874017 0.0758168 0.0728169 -0.1867268 -0.014404 -0.0252296 0.0294874 -0.2546558 -0.1001052 0.1067195 -0.016444 -0.0413494 0.0488786 -0.0122762 -0.0953416 0.0557328 0.104766 0.533744 -0.1960941 0.0304407 -0.1262078 0.1832663 -0.0418579 0.0757806 -0.0325096 0.1420353 0.5461816 -0.1262303 -0.0374123 -0.0908053 -0.0302949 -0.0025239 -0.1461925 0.0462399 -0.0457466 -0.1655239 0.0614495 -0.05756 -0.0974134 0.0372105 -0.0452568 0.0929985 -0.1265335 -0.0433663 0.6546394 0.0007474 -0.622056 0.2603872 0.9857846 0.1402522 -0.6946522 0.1930728 0.9268228 -0.0861652 -0.0114104 -0.0173248 0.2009171 -0.0284199 -0.148244 -0.15779 -0.0632878 -0.0352312 1.2503665 -0.5027542 -0.0950748 -0.3781702 0.1341321 0.1586287 -0.2171151 0.2024638 0.0622111 -0.2144882 0.1456654 -0.0892714 -0.2645506 0.1883037 -0.1153078 0.2128573 -0.2526051 -0.0000773 0.0194406 0.0072782 0.0512827 -0.0262456 0.071058 0.0715975 0.0543039 0.0064488 -0.0518224 0.0277514 -0.0316933 0.0041602 0.0087004 -0.1084332 -0.0212934 -0.0052294 -0.0077742 0.0815856 0.0490963 -0.002656 0.0559125 0.0118247 0.0350231 0.0328319 0.0661748 0.026731 -0.0735267 0.0911714 0.0793975 -0.0146728 0.0749659 -0.0291717 0.0816284 -0.0140293 0.0791256 0.0954619 0.1684825 0.0120877 0.0172228 -0.0679702 0.2949738 0.1606585 0.0371278 0.0888831 0.1183186 0.036569 0.0035025 -0.0586342 -0.1402317 0.3196853 -0.1047633 -0.0443191 -0.0547308 0.0926074 0.0322425 -0.0407612 0.0739523 -0.0389193 0.0846539 0.063042 0.0795934 0.0639967 0.0918929 0.0102869 0.1011959 -0.021315 0.125231 -0.0587752 0.0840526 -0.0234773 0.0820355 0.0921594 0.3478104 -0.023088 0.0471901 -0.0150844 0.0942912 0.0483377 0.0969194 0.1056983 0.3149818 0.4042507 -0.0764612 0.0513216 -0.0505103 0.1843155 0.1434698 0.0285621 0.1589116 0.2758795 unknown
polarizability: 140.5045783|-16.4394196|104.1411091|-13.6777163|-12.6775851|78.4446024 unknown
InChI: InChI=1S/C8H10N2O3/c9-7(8(12)13)3-5-1-2-6(11)4-10-5/h1-2,4,7,11-12H,3,9H2
charge 0 multiplicity 1
23 atoms
O  -1.489827 -1.504973 -1.264336
O  -2.948031 -1.567913 0.545477
O  4.169086 -0.679875 -0.324761
N  -3.486629 1.26773 -0.045368
N  0.688734 -0.489667 1.008918
C  -1.138346 1.134712 0.720807
C  -2.189593 0.63179 -0.322971
C  0.280647 0.68571 0.436774
C  1.147069 1.438582 -0.40065
C  -2.266907 -0.905018 -0.267784
C  2.452761 0.97979 -0.658567
C  2.865547 -0.23499 -0.064742
C  1.950576 -0.93401 0.76125
H  -1.439167 0.772521 1.720952
H  -1.214563 2.235993 0.709857
H  -1.853298 0.922222 -1.333021
H  0.798082 2.378721 -0.840883
H  -3.892698 0.951456 0.844195
H  -4.162301 1.175236 -0.811891
H  3.148427 1.53418 -1.294969
H  2.238514 -1.879297 1.2447
H  -1.51255 -2.494698 -1.151894
H  4.353267 -1.5339 0.140708
