program: Gaussian 09
title: 000122068
version: EM64L-G09RevD.01
frameworkgroup: C1[X(C18H18ClN3O)]
method: RPBEPBE
basis: SDD
operation: Freq
keyword: #p
keyword: freq=noraman
keyword: PBEPBE/SDD
title: #p freq=noraman PBEPBE/SDD
converged: YES YES NO NO
title: Mulliken charges:
elementType: Cl O N N N C C C C C C C C C C C C C C C C C C H H H H H H H H H H H H H H H H H H
charge: -0.055678 -0.421757 -0.519258 -0.284404 -0.042966 0.392468 -0.507466 0.481744 0.349360 -0.555449 0.250946 0.104282 -0.445551 -0.027433 -0.365086 -0.314430 -0.324153 -0.349314 -0.291279 -0.381852 -0.265824 -0.094080 -0.690313 0.240841 0.187599 0.279609 0.304204 0.239467 0.246356 0.220368 0.213359 0.176679 0.256019 0.207122 0.287646 0.236394 0.256214 0.202143 0.233994 0.212319 0.357164
chargesum: 0.00000
title: Mulliken charges with hydrogens summed into heavy atoms:
elementType: Cl O N N N C C C C C C C C C C C C C C C C C C
charge: -0.055678 -0.064593 -0.215054 -0.038048 -0.042966 0.392468 -0.079027 0.481744 0.349360 -0.275840 0.250946 0.104282 -0.206084 -0.027433 -0.144718 0.075607 -0.068134 -0.142193 -0.003633 -0.145458 -0.009610 -0.094080 -0.041857
polarizability: 4.07422600e+02 1.64226077e+01 2.41445194e+02 1.37672354e+01 -4.47014375e+00 1.30171058e+02
1716.lowfreq: -0.0005 -0.0004 0.0007 2.3138 4.8022 10.5491 16.6423 24.1896 31.2070
frequency: 16.5419 24.0149 31.1924 51.6080 70.2500 73.7075 87.5512 113.0283 131.0245 137.3498 167.3433 215.7403 222.9040 231.6975 241.4108 255.6658 276.2980 291.9720 314.3800 321.4276 357.4628 368.3455 402.3186 421.5271 438.8658 450.0450 472.5956 480.9817 505.0103 518.9431 532.8869 562.7147 587.4395 614.0881 625.1370 635.9078 642.7109 656.2497 715.9871 748.1147 763.8230 764.8772 769.9327 801.1868 810.4925 814.5926 836.4804 838.7131 871.3662 897.6713 902.4179 912.9164 922.2636 938.6559 941.0593 960.1017 986.4396 1028.3455 1043.6595 1062.4097 1083.6829 1096.5522 1107.7294 1130.8862 1145.8738 1161.6902 1164.0201 1183.8883 1208.7187 1219.0187 1239.2076 1246.7821 1264.5409 1267.6124 1291.8510 1307.2086 1322.4304 1336.4179 1356.0861 1378.0603 1383.6551 1391.4134 1396.5399 1415.8807 1435.5695 1438.4438 1442.0118 1469.9934 1471.6422 1479.2113 1482.9780 1498.0916 1504.4631 1528.6819 1556.3215 1579.8314 1607.9893 1610.3311 1624.1095 2844.3542 2852.5693 2978.6226 2999.1816 3036.5311 3070.8012 3093.2398 3115.1458 3121.3637 3121.4611 3138.5635 3142.7164 3173.9655 3178.2160 3183.8019 3428.3959 3552.6948 3584.1584
redmass: 5.2705 5.2234 5.1576 5.1962 1.7811 3.8341 5.1706 4.5829 3.5441 4.8991 5.8146 4.4807 7.0112 3.7434 1.2362 5.0514 4.0925 3.2626 4.9658 1.1280 11.5762 3.6282 3.0843 3.2964 3.9790 2.8033 2.5199 2.3735 2.9823 4.7756 4.9180 5.1742 5.6077 5.9510 3.6405 2.8842 2.1470 4.5490 3.9130 5.0856 2.4822 4.3659 2.8921 1.6234 1.1125 2.5103 3.4492 1.6330 5.8087 1.5022 1.5566 1.4209 1.4529 1.7564 1.9027 1.3972 1.8319 3.4720 3.0866 1.8750 2.1029 2.5531 2.1981 1.4929 2.5701 1.4307 1.2108 1.8537 2.1507 1.4138 1.5111 1.8709 1.1821 3.3335 1.5597 2.0306 1.2803 1.9857 3.0629 2.1141 1.8132 1.4636 4.5639 4.1717 2.9989 2.1253 1.4311 1.0797 1.9046 1.1332 1.1255 1.1203 2.7945 4.0201 4.3132 5.7795 7.3679 5.3660 6.5254 1.0726 1.0716 1.0376 1.0858 1.0864 1.0978 1.1002 1.0877 1.0888 1.0899 1.0929 1.0955 1.0951 1.0934 1.0933 1.0745 1.0749 1.0661
irintensity: 0.2428 0.3688 1.5862 1.2481 2.4695 1.1341 0.3493 1.1515 2.8913 0.9117 0.0652 2.9022 0.5168 0.1486 1.5505 0.9701 7.1404 6.1747 1.1671 117.2941 7.2602 26.2352 0.5343 8.8749 13.4935 8.2335 41.9995 32.3437 40.0431 33.4010 11.6217 12.4745 19.8227 2.1062 23.6385 4.9808 75.0187 9.5962 0.2381 8.0861 3.7799 8.9945 33.9994 30.2507 4.4612 28.7291 69.7961 45.6930 36.7860 23.6799 4.9759 3.8969 5.1379 3.3663 3.0182 2.3855 20.2386 5.6177 11.9921 21.2691 176.2500 11.6129 8.6569 22.0473 57.2601 20.0193 62.8623 55.4686 15.1075 1.7626 0.9647 47.5006 18.4917 46.4450 4.8685 37.2941 20.1556 40.9746 42.0948 7.6952 2.3224 42.3837 105.1533 19.8681 73.4558 139.1878 56.8286 26.5833 22.8083 10.0937 0.6103 8.5679 121.9607 209.2763 307.9813 239.9112 27.6926 72.4587 0.7160 59.0360 179.4109 29.9742 30.9667 12.2253 59.9988 35.8760 24.7911 21.6550 14.9056 11.5219 6.9197 3.9706 12.7068 0.9026 1.7010 17.3266 58.7294
temp: 298.150 k
press: 1.00000 atm
elementType: 17 8 7 7 7 6 6 6 6 6 6 6 6 6 6 6 6 6 6 6 6 6 6 1 1 1 1 1 1 1 1 1 1 1 1 1 1 1 1 1 1
symmnumber: 1
zpe: 845311.5 jmol-1
zpe.correction: 0.321962 hartree
zpe.thermalcorrener: 0.343325 hartree
zpe.thermalcorrenthalpy: 0.344269 hartree
zpe.thermalcorrgfe: 0.269323 hartree
zpe.sumelectzpe: -1394.605350 hartree
zpe.sumelectthermal: -1394.583987 hartree
zpe.sumelectthermalent: -1394.583043 hartree
zpe.sumelectthermalfe: -1394.657989 hartree
dipole: -4.2210 -4.3193 -0.0002
dipole: 6.0393
quadrupole: -158.8703 -125.7298 -145.4750
quadrupole: -5.0163 2.5443 5.6476
quadrupole: -15.5120 17.6286 -2.1166 -5.0163 2.5443 5.6476
hfenergy: -1394.9273123 hartree
pointgroup: C01 [X(C18H18Cl1N3O1)]
dipole: 1.7313381 -1.6272256 -0.0143254 debye
polarizability: 408.5631914|-9.4023252|240.2742307|13.0170322|5.8399383|130.20143 unknown
InChI: InChI=1S/C18H18ClN3O/c1-2-20-11-12-9-14(4-6-18(12)23)22-16-7-8-21-17-10-13(19)3-5-15(16)17/h3-10,20,22-23H,2,11H2,1H3
charge 0 multiplicity 1
41 atoms
Cl -7.315834 -0.172323 -0.624861
O  5.097965 -1.891404 -0.104165
N  -0.524942 -1.27416 0.21449
N  4.417156 1.482911 -0.29157
N  -2.940777 2.230564 0.793473
C  3.116739 -0.596558 -0.570233
C  3.966773 0.454998 -1.261438
C  0.897475 -1.389926 0.180277
C  -1.287773 -0.114433 0.363388
C  1.715309 -0.449188 -0.499999
C  -2.716693 -0.163357 0.094092
C  3.706209 -1.746344 0.023975
C  1.508289 -2.521605 0.774338
C  -3.492837 1.03488 0.347877
C  2.902764 -2.706851 0.681564
C  5.310046 2.513549 -0.863791
C  -0.748032 1.1133 0.802017
C  -3.389887 -1.319873 -0.413574
C  -4.908684 1.014814 0.126966
C  -1.605209 2.231016 0.993884
C  -4.771401 -1.324556 -0.630988
C  -5.513831 -0.145073 -0.342568
C  5.705066 3.548588 0.203003
H  4.870453 -0.01866 -1.685511
H  3.386682 0.890203 -2.114886
H  1.250615 0.401098 -1.01127
H  -1.036384 -2.157015 0.202827
H  0.896121 -3.255678 1.311046
H  3.622633 1.898969 0.215179
H  3.362254 -3.595719 1.132755
H  6.218206 2.001921 -1.239489
H  4.854246 3.038196 -1.743152
H  0.312821 1.205106 1.0443
H  -2.831633 -2.225031 -0.680668
H  -5.469433 1.929376 0.334525
H  -1.176897 3.175976 1.350212
H  -5.277066 -2.209138 -1.027707
H  4.81732 4.089502 0.584287
H  6.195068 3.049359 1.057021
H  6.399913 4.298693 -0.215843
H  5.414489 -2.696328 0.375515
