program: Gaussian 09
title: 000122034
version: EM64L-G09RevD.01
frameworkgroup: C1[X(C9H9N5O)]
method: RPBEPBE
basis: SDD
operation: Freq
keyword: #pfreq=noraman
keyword: PBEPBE/SDD
title: #p freq=noraman PBEPBE/SDD
converged: YES YES NO NO
title: Mulliken charges:
elementType: O N N N N N C C C C C C C C C H H H H H H H H H
charge: -0.252776 -0.246253 -0.113422 -0.373291 -0.120470 -0.103416 0.172197 0.118013 0.074333 0.153249 -0.312898 0.236910 -0.617444 -0.214347 -0.782764 0.293293 0.253245 0.264475 0.253377 0.341079 0.270991 0.239719 0.226627 0.239574
chargesum: 0.00000
title: Mulliken charges with hydrogens summed into heavy atoms:
elementType: O N N N N N C C C C C C C C C
charge: -0.252776 -0.246253 -0.113422 -0.032212 -0.120470 -0.103416 0.172197 0.118013 0.074333 0.153249 -0.019605 0.236910 0.153653 0.056644 -0.076844
polarizability: 2.02958425e+02 -1.75601564e+00 1.47295182e+02 -2.60314062e-02 -7.23244660e-03 6.20651812e+01
1716.lowfreq: -8.4649 -5.1777 0.0005 0.0007 0.0009 7.0513 74.2608 105.1109 107.7372
frequency: 74.2584 105.1029 107.7233 122.2970 176.5793 192.1598 193.1996 215.8238 263.3948 291.5354 335.0781 368.8305 396.8231 400.5773 503.6109 510.0753 597.4016 627.2548 655.3698 667.5021 677.4431 684.3317 690.8768 735.0308 760.8244 786.7214 816.9395 907.3636 934.3569 966.0048 992.6821 1030.3407 1047.7645 1096.3892 1115.9116 1129.4644 1136.0712 1173.7676 1229.9861 1255.3166 1283.3188 1311.5215 1324.9811 1365.2844 1373.2412 1402.7075 1410.1343 1427.8114 1457.1388 1468.6677 1468.7028 1476.7646 1502.7246 1545.9237 1568.3401 1592.3172 1652.2544 2986.9858 3008.3507 3067.0529 3097.9056 3098.8827 3138.7400 3248.7900 3263.3845 3590.1882
redmass: 4.2435 1.0505 1.2773 2.3949 5.4974 6.2539 3.2750 4.6216 3.3908 6.4005 5.9135 3.8354 6.7016 7.2929 6.3101 7.6087 4.4247 3.1874 1.6771 5.3344 8.2249 2.3313 6.2139 6.4999 1.5891 5.4208 1.4146 7.6913 4.9017 3.6920 1.5522 5.2936 1.5026 1.9365 2.1692 1.2954 2.9112 2.0443 2.6717 2.9613 5.8526 8.0297 5.1274 5.5443 3.2301 1.2848 3.7003 1.2839 1.0448 1.0419 1.1274 1.1215 4.3076 6.1755 5.9631 7.0656 11.5835 1.0370 1.0330 1.0978 1.1023 1.0992 1.1027 1.0994 1.1001 1.0825
irintensity: 1.7774 0.0050 1.0764 1.5275 1.9837 18.0648 3.8351 0.0004 13.1171 10.3247 9.2239 3.9214 0.0254 4.4686 5.1564 11.7183 12.2453 30.8815 49.5650 3.7040 1.5959 57.9131 1.0712 15.8519 26.0672 12.5197 18.9641 3.5215 0.2050 5.1407 9.7762 4.8405 7.0238 70.6938 31.4943 0.5018 18.3479 37.2239 10.8128 7.9355 40.3388 44.5120 89.9440 9.9253 40.5414 14.4034 65.2754 13.6062 14.4142 16.6758 22.1358 11.0677 9.7471 118.6246 80.6110 221.0939 479.7437 32.4781 32.9954 17.4193 14.7810 18.3005 0.6974 1.5821 5.2306 98.6355
temp: 298.150 k
press: 1.00000 atm
elementType: 8 7 7 7 7 7 6 6 6 6 6 6 6 6 6 1 1 1 1 1 1 1 1 1
symmnumber: 1
zpe: 473148.8 jmol-1
zpe.correction: 0.180213 hartree
zpe.thermalcorrener: 0.192688 hartree
zpe.thermalcorrenthalpy: 0.193632 hartree
zpe.thermalcorrgfe: 0.141625 hartree
zpe.sumelectzpe: -696.296472 hartree
zpe.sumelectthermal: -696.283997 hartree
zpe.sumelectthermalent: -696.283052 hartree
zpe.sumelectthermalfe: -696.335059 hartree
dipole: 2.4921 0.5600 0.0010
dipole: 2.5543
quadrupole: -68.8330 -92.7637 -88.3309
quadrupole: -4.4440 -0.0072 0.0003
quadrupole: 14.4762 -9.4545 -5.0217 -4.4440 -0.0072 0.0003
hfenergy: -696.4766844 hartree
pointgroup: C01 [X(C9H9N5O1)]
dipole: 0.984817 -0.1998172 -0.0087576 debye
dipolederiv: -0.4946446 0.0655835 0.0009492 -0.1414895 -1.4168705 0.0063097 0.0019032 0.0043601 -0.3598577 -0.5984269 -0.4770967 0.007855 -0.7743273 -0.7738048 0.0111803 0.0091377 0.0081328 -0.0054141 -1.0051566 -0.1230877 0.0092034 -0.0287889 -0.7765516 0.0037515 0.0086715 0.0032887 -0.1135755 -0.250045 -0.1142137 0.0010422 -0.2575211 -0.6031518 0.0043655 0.0017505 0.0030157 -0.2098864 -1.0592956 0.1684173 0.0069539 -0.0863715 -0.3742215 0.0014608 0.0081321 -0.0011132 -0.264183 -0.7753329 -0.3059646 0.0063576 -0.0588305 -0.4109416 0.0012767 0.0051201 0.0035906 -0.2617951 1.0811324 -0.1936738 -0.0085852 0.2857284 0.4834394 -0.0047852 -0.011205 0.0000731 0.112446 0.9938404 0.5019721 -0.0110153 0.3259019 0.4824912 -0.005051 -0.0101331 -0.0063291 0.0866313 -0.080674 0.651137 -0.0031293 0.2644008 -0.5653309 -0.0000945 -0.0011209 -0.003652 -0.0706589 1.1486206 -0.1166784 -0.0076921 0.2887887 1.8712328 -0.0102551 -0.0097059 -0.0065666 0.254054 -0.1987355 -0.0427396 0.0000104 -0.0630022 -0.1872002 0.0002608 -0.0000952 0.0002735 -0.2154056 0.744273 -0.0784998 -0.0067564 0.0373152 0.3855017 -0.0023399 -0.0039647 -0.0004168 -0.0392596 0.050342 0.0216287 0.0012119 0.0005319 0.5975738 -0.0026048 0.0013529 -0.0024378 0.197666 0.0623496 0.112512 -0.0016478 0.2346399 0.7116457 -0.0058691 -0.002284 -0.0047922 -0.0511414 -0.1544029 -0.0014967 0.0021995 -0.1231402 0.0633024 0.0017936 -0.0019903 -0.0005592 0.0639739 0.1007785 -0.0160684 0.0014189 0.0340996 0.0580376 0.0005045 0.0013053 0.0009133 0.2267817 0.0794249 -0.081264 0.0851987 -0.0124302 -0.002101 0.0139001 0.0628429 0.0792125 -0.0384464 -0.0030141 0.1035803 0.0013733 0.0158872 0.1037451 0.0000385 0.0016291 -0.0008496 0.1277616 0.075869 -0.0842784 -0.0871178 -0.0134349 -0.0019822 -0.0136869 -0.065322 -0.0770547 -0.0333539 0.2574905 0.0690171 0.0006198 0.0514094 0.2315715 0.0001177 0.0006701 -0.0000961 0.359954 0.0146068 -0.0280458 0.0017922 -0.0238719 0.1085685 0.0006155 0.0017887 0.0006769 0.1905009 0.000128 -0.0310309 0.0321024 -0.0501152 0.0524462 0.103114 0.1007924 0.0967139 -0.0367966 0.0162216 0.0339596 0.0015314 0.1460151 -0.0925466 -0.0034292 0.0026435 -0.0015537 0.1174068 -0.0053489 -0.0336691 -0.0338759 -0.0513946 0.0551469 -0.1005735 -0.101919 -0.0948302 -0.0374019 unknown
polarizability: 202.8484319|2.9126229|147.3907282|-1.3210191|-0.4461065|62.0796282 unknown
InChI: InChI=1S/C9H9N5O/c1-5-3-14-8(15)6-7(11-4-10-6)13(2)9(14)12-5/h3-4,10H,1-2H3
charge 0 multiplicity 1
24 atoms
O  0.266439 2.865768 -0.010803
N  -0.835399 0.757995 0.009287
N  0.339947 -1.386062 0.008521
N  2.861433 1.121191 -0.027084
N  -2.09591 -1.158289 0.031072
N  2.808637 -1.15605 -0.015677
C  -0.849997 -0.665053 0.016457
C  1.510647 -0.651072 -0.005833
C  1.505345 0.765263 -0.012676
C  0.333131 1.600902 -0.005536
C  -2.188279 1.154361 0.020494
C  -2.941682 -0.019472 0.033745
C  0.312883 -2.860721 0.016358
C  3.595186 -0.052114 -0.028327
C  -4.433146 -0.173559 0.048151
H  -2.462048 2.20407 0.018107
H  -0.206834 -3.222866 0.919047
H  1.353762 -3.215818 0.004968
H  -0.229723 -3.231442 -0.869129
H  3.209529 2.079716 -0.034755
H  4.681871 -0.073849 -0.038471
H  -4.759072 -0.7457 0.935722
H  -4.934087 0.808683 0.061722
H  -4.778533 -0.730381 -0.84196
