program: Gaussian 09
title: 000122056
version: EM64L-G09RevD.01
frameworkgroup: C1[X(C15H14INO4)]
method: RPBEPBE
basis: SDD
operation: Freq
keyword: #p
keyword: freq=noraman
keyword: PBEPBE/SDD
title: #p freq=noraman PBEPBE/SDD
converged: YES YES NO NO
title: Mulliken charges:
elementType: I O O O O N C C C C C C C C C C C C C C C H H H H H H H H H H H H H H
charge: 0.124199 -0.302604 -0.401750 -0.246298 -0.419583 -0.572582 -0.604288 -0.185127 0.517816 -0.391025 -0.384906 0.325300 -0.366376 -0.384545 0.200829 0.342471 -0.292653 -0.371218 -0.497227 -0.326302 0.434697 0.228660 0.215169 0.262067 0.251045 0.232663 0.266571 0.255554 0.277970 0.290604 0.290418 0.261582 0.228221 0.379149 0.361497
chargesum: 0.00000
title: Mulliken charges with hydrogens summed into heavy atoms:
elementType: I O O O O N C C C C C C C C C C C C C C C
charge: 0.124199 -0.302604 -0.022601 -0.246298 -0.058086 -0.004007 -0.160458 0.076940 0.517816 -0.139980 -0.152243 0.325300 -0.099805 -0.128992 0.200829 0.342471 -0.002235 -0.109636 -0.497227 -0.098081 0.434697
polarizability: 2.90824985e+02 3.49310137e+00 2.17480094e+02 1.55755580e+01 -8.36320675e+00 1.26530897e+02
1716.lowfreq: -3.5477 0.0003 0.0006 0.0008 2.8186 5.3856 12.9708 14.3947 25.1366
frequency: 12.7861 14.3460 25.0915 27.2267 51.0701 53.6059 68.0737 120.3876 122.2961 156.7436 178.1709 206.7431 214.5216 223.4273 249.1415 272.4844 301.3872 314.1144 333.4929 350.1856 369.1319 387.7912 411.1518 434.4696 441.6582 460.5156 502.3734 512.0610 542.2558 550.5495 595.2935 603.2299 629.5843 633.1293 650.5520 697.6836 704.3008 725.1239 740.0890 767.8202 788.7288 797.8302 820.8020 834.0424 845.9020 873.0121 883.8378 922.3003 943.3808 951.0219 969.5919 985.0579 1006.8706 1012.5391 1060.8966 1092.3936 1107.2389 1108.3067 1139.0944 1146.8855 1155.2095 1184.8148 1185.3458 1209.1691 1221.0373 1258.3736 1261.4503 1278.0329 1289.5628 1303.3928 1322.0791 1368.0925 1381.4836 1398.4980 1404.7808 1416.0290 1464.0818 1478.7040 1494.6777 1570.8296 1589.6273 1610.7306 1613.5639 1621.0024 1666.8543 2990.1351 3047.2310 3066.2312 3123.3663 3124.0903 3127.6315 3158.3184 3168.3252 3171.4404 3177.0386 3476.1392 3494.3132 3583.9958 3613.8962
redmass: 7.1011 8.6621 5.8759 9.3190 6.3431 4.5977 4.4768 7.1527 5.4768 7.0642 6.2998 5.4308 1.8465 5.3446 3.7294 2.5434 3.1506 4.8924 1.1252 6.5625 3.0662 4.9593 2.9787 3.1523 4.5099 3.8057 2.6841 4.6209 1.9238 3.4509 3.1692 3.8146 1.4715 4.7447 7.0210 4.4909 4.2307 4.4897 4.4104 3.0882 4.2540 1.5325 3.2923 1.2597 2.1351 6.3084 1.4976 1.3422 1.6587 1.4816 1.3701 4.2289 2.8178 3.1293 2.6558 1.4299 1.5995 1.5510 1.3657 1.2518 2.0642 1.4442 1.3965 2.0506 3.6646 2.5895 1.6363 1.6347 1.3851 1.3159 1.2206 4.4194 5.5842 5.0997 1.9904 2.9159 1.1096 2.6911 2.6635 7.1834 7.2350 5.7379 1.3695 6.6293 3.6715 1.0594 1.0965 1.0938 1.0898 1.0901 1.0893 1.0951 1.0953 1.0922 1.0951 1.0444 1.0637 1.0661 1.0994
irintensity: 0.5529 0.2303 3.8485 3.2702 1.3332 0.1059 0.6905 1.3177 2.3930 2.1694 2.1909 6.4845 51.0275 0.8769 6.2656 29.6259 5.0629 5.1247 132.7383 5.8987 0.1609 8.6687 0.8729 14.6606 16.1510 2.1344 36.6912 20.0338 191.5452 68.7165 9.0880 14.3838 213.9388 23.3686 5.1601 6.8662 18.5506 42.9660 22.4966 3.3621 25.5761 49.0979 21.6773 1.3556 38.1624 52.1345 16.0422 0.1941 10.8141 3.5002 0.4533 51.5649 13.4618 28.3067 203.3603 4.8793 163.3498 62.2596 10.9367 69.5799 57.5467 29.4403 5.5394 209.0084 123.3433 10.3931 7.4425 123.7993 3.9062 0.6609 5.0642 87.6563 15.0014 3.5049 11.5855 8.9675 10.7209 411.6752 63.1718 29.0601 3.1616 19.4832 149.7213 11.4095 111.8279 41.8221 4.5710 20.5829 17.4186 16.7968 15.1460 6.3852 4.3580 0.4749 2.9470 10.2865 14.5619 53.6301 7.9776
temp: 298.150 k
press: 1.00000 atm
elementType: 53 8 8 8 8 7 6 6 6 6 6 6 6 6 6 6 6 6 6 6 6 1 1 1 1 1 1 1 1 1 1 1 1 1 1
symmnumber: 1
zpe: 681951.4 jmol-1
zpe.correction: 0.259742 hartree
zpe.thermalcorrener: 0.280361 hartree
zpe.thermalcorrenthalpy: 0.281305 hartree
zpe.thermalcorrgfe: 0.205112 hartree
zpe.sumelectzpe: -945.616127 hartree
zpe.sumelectthermal: -945.595508 hartree
zpe.sumelectthermalent: -945.594563 hartree
zpe.sumelectthermalfe: -945.670756 hartree
dipole: -0.1153 3.2074 0.2613
dipole: 3.2201
quadrupole: -107.5717 -135.8472 -139.5675
quadrupole: 2.8053 9.4666 2.5511
quadrupole: 20.0904 -8.1850 -11.9054 2.8053 9.4666 2.5511
hfenergy: -945.8758688 hartree
pointgroup: C01 [X(C15H14I1N1O4)]
dipole: 0.2768524 -1.2172664 -0.2158996 debye
polarizability: 286.8645215|16.2466892|222.0264749|-16.1434205|-4.3611923|125.9449794 unknown
InChI: InChI=1S/C15H14INO4/c16-12-8-11(5-6-14(12)18)21-10-3-1-9(2-4-10)7-13(17)15(19)20/h1-6,8,13,18-19H,7,17H2
charge 0 multiplicity 1
35 atoms
I  3.232517 3.483225 0.458914
O  1.674191 -1.860667 0.275791
O  -2.9933 1.993882 1.048618
O  -4.065852 2.07013 -1.008801
O  5.800871 1.88558 -0.590509
N  -5.995694 0.413943 0.413884
C  -3.997128 -0.98568 -0.361465
C  -4.546947 0.19996 0.524548
C  -2.502809 -1.219578 -0.226177
C  -1.583126 -0.596332 -1.109639
C  -1.984037 -2.034311 0.813805
C  0.29512 -1.568155 0.096736
C  -0.190335 -0.765734 -0.961141
C  -0.595275 -2.211322 0.982399
C  -3.873676 1.500789 0.090181
C  2.66141 -0.881588 0.007861
C  2.465533 0.494747 0.275236
C  3.910243 -1.354548 -0.445743
C  3.525856 1.397931 0.065642
C  4.966409 -0.443366 -0.641764
C  4.785419 0.941358 -0.39643
H  -4.268866 -0.760997 -1.410356
H  -4.561543 -1.887344 -0.054964
H  -4.286361 0.011051 1.5795
H  -1.960731 0.023933 -1.931611
H  -2.674247 -2.538602 1.501307
H  0.503746 -0.291955 -1.662557
H  -0.189006 -2.838827 1.781154
H  -6.57686 -0.332374 0.800859
H  -6.301411 0.749566 -0.504092
H  1.502672 0.85109 0.650267
H  4.040836 -2.423503 -0.633678
H  5.938901 -0.808604 -0.995349
H  -2.564349 2.828159 0.710644
H  6.631532 1.452943 -0.909071
