program: Gaussian 09
title: 000122114
version: EM64L-G09RevD.01
frameworkgroup: C1[X(C17H18N4O5)]
method: RPBEPBE
basis: SDD
operation: Freq
keyword: #p
keyword: freq=noraman
keyword: PBEPBE/SDD
title: #p freq=noraman PBEPBE/SDD
converged: YES YES NO NO
title: Mulliken charges:
elementType: O O O O O N N N N C C C C C C C C C C C C C C C C C H H H H H H H H H H H H H H H H H H
charge: -0.316582 -0.261415 -0.135632 -0.244304 -0.233224 -0.407736 0.030337 -0.090343 -0.048794 -0.432288 0.067048 0.196006 0.597188 0.245617 0.246578 -0.068924 0.153749 -0.411455 -0.840385 -0.757346 0.029992 -0.192466 -0.335869 0.051093 -0.684776 -0.691974 0.315127 0.312904 0.260034 0.231224 0.249585 0.323851 0.276141 0.280007 0.194005 0.238663 0.235766 0.263394 0.213845 0.258636 0.217885 0.214684 0.232245 0.217911
chargesum: 0.00000
title: Mulliken charges with hydrogens summed into heavy atoms:
elementType: O O O O O N N N N C C C C C C C C C C C C C C C C C
charge: -0.316582 -0.261415 -0.135632 -0.244304 -0.233224 -0.094832 0.030337 -0.090343 -0.048794 -0.117161 0.067048 0.196006 0.597188 0.245617 0.246578 -0.068924 0.153749 -0.151421 -0.035725 -0.007193 0.029992 0.046197 -0.072475 0.286859 0.005590 -0.027135
polarizability: 2.49926873e+02 9.66195064e+00 2.38098771e+02 7.58895965e+00 -3.14263327e+01 2.32962021e+02
1716.lowfreq: -7.1326 -4.0980 -0.0005 -0.0003 0.0000 2.3567 13.0109 16.4935 38.4462
frequency: 12.6956 16.4316 38.4137 43.5338 53.4926 62.2046 69.9496 79.7260 87.8384 91.3301 98.2324 154.1159 169.9507 177.3854 180.9557 193.2188 212.5896 221.0059 231.7120 250.4538 270.3031 290.9603 318.5406 327.4762 333.8836 355.5897 361.1123 387.1656 401.2877 419.0501 449.7490 476.3026 520.1111 544.9830 550.6177 561.4907 563.9517 577.4607 586.8015 594.3707 608.2219 620.3685 663.1110 672.1268 703.8241 712.7057 731.0781 748.0559 754.3287 768.7790 787.0331 794.0687 829.2611 841.4028 863.5370 899.7292 925.6519 926.7347 935.9167 942.8485 965.0008 988.4519 1005.3089 1027.5566 1037.0832 1040.2858 1041.5484 1052.0067 1067.3558 1100.5825 1127.7923 1152.3877 1156.0917 1171.4128 1180.0428 1207.0319 1235.3520 1246.2411 1288.2318 1295.5014 1299.9329 1306.2214 1308.7078 1330.5913 1338.0818 1351.9344 1354.6326 1369.0073 1381.5739 1393.8185 1396.6437 1406.8799 1435.4426 1446.9051 1456.6158 1465.0396 1466.3400 1468.1124 1472.4499 1479.0824 1487.3695 1489.3431 1490.8668 1543.1717 1565.8824 1606.8582 1628.8480 1656.1770 2975.2813 2988.7950 2992.0361 2992.1858 3033.9247 3041.7726 3047.6883 3083.1113 3088.2736 3092.2893 3096.9869 3105.4234 3106.3932 3149.9452 3163.1165 3171.5061 3188.4115 3544.9936
redmass: 4.2832 6.4704 3.7423 4.9222 1.1381 3.5106 6.5191 5.1465 4.4060 6.3267 4.1027 6.5247 5.2420 1.1243 5.5889 1.0461 3.8235 6.5287 1.3205 3.0535 4.7682 4.9364 3.0163 5.8394 5.1709 3.5094 5.5269 4.1103 3.5388 7.0147 3.1114 4.8174 4.3184 5.1856 4.5321 5.6982 4.8953 5.4129 3.0957 4.3515 1.8711 5.2385 8.0114 7.0897 11.5754 7.0714 6.8406 2.8926 6.1276 6.3897 4.8474 2.1372 3.8023 13.6630 6.7657 2.5682 1.2217 1.4507 11.4613 1.3695 1.6199 1.3613 6.6859 1.5942 1.5433 4.7677 2.4550 1.5597 6.5179 1.7197 3.0886 2.5188 2.0510 1.6705 2.0099 3.0756 4.1105 1.8167 3.7641 2.4224 2.6009 1.8941 3.6972 2.0627 1.5171 2.3115 3.2664 2.0841 1.2592 1.2282 1.2324 1.1800 1.0538 1.2409 1.0569 1.0551 3.6520 1.2687 1.0724 1.8196 1.0508 4.0234 1.0483 6.9046 9.9133 6.4981 4.0487 7.3417 1.0418 1.0357 1.0363 1.0395 1.0866 1.0830 1.0970 1.0996 1.0978 1.0984 1.1003 1.0966 1.1005 1.0882 1.0938 1.0929 1.0982 1.0774
irintensity: 0.2588 3.8709 2.4878 0.5930 1.0083 4.5659 5.7632 1.4875 1.0113 0.8950 0.9502 0.0373 0.8927 1.1383 2.2436 0.0041 0.9926 0.0581 0.3321 2.0238 0.1665 7.0513 2.9202 2.5354 2.6168 0.2587 0.3857 0.9419 10.5216 2.0342 2.3214 1.4329 1.0346 11.7028 1.8247 1.7767 15.6229 2.6438 11.0789 7.8609 48.8172 4.4414 2.0841 1.9272 10.2984 12.9905 13.7900 26.8222 11.2807 5.6218 4.4583 63.4214 1.7401 11.6417 2.9785 20.4729 2.1447 1.5787 3.0063 0.4202 5.3641 0.3531 299.8794 22.1473 11.4163 7.8494 3.1263 7.2617 94.4411 121.2069 60.1954 38.6453 11.0003 10.9271 127.3386 674.3543 31.0363 0.3679 76.7622 27.1994 5.1882 24.5438 5.0926 58.3713 21.4130 3.9797 27.2412 3.6961 32.5300 29.9073 34.1348 87.6532 27.6695 116.1148 7.9785 9.2178 18.0088 10.1645 12.9649 278.3005 21.7595 1.5947 10.1045 11.2763 114.5744 0.8438 58.6489 170.4572 24.5356 14.3655 24.6398 22.1285 4.4061 1.3414 13.9256 1.7644 14.0599 62.6170 25.3228 5.4396 21.3504 10.8192 6.1603 1.7899 5.7761 52.2054
temp: 298.150 k
press: 1.00000 atm
elementType: 8 8 8 8 8 7 7 7 7 6 6 6 6 6 6 6 6 6 6 6 6 6 6 6 6 6 1 1 1 1 1 1 1 1 1 1 1 1 1 1 1 1 1 1
symmnumber: 1
zpe: 871534.3 jmol-1
zpe.correction: 0.331950 hartree
zpe.thermalcorrener: 0.356926 hartree
zpe.thermalcorrenthalpy: 0.357870 hartree
zpe.thermalcorrgfe: 0.274563 hartree
zpe.sumelectzpe: -1251.693089 hartree
zpe.sumelectthermal: -1251.668113 hartree
zpe.sumelectthermalent: -1251.667169 hartree
zpe.sumelectthermalfe: -1251.750475 hartree
dipole: 5.3621 -1.9256 3.0888
dipole: 6.4808
quadrupole: -150.9845 -135.0893 -162.6114
quadrupole: -3.5711 -5.8654 -23.5402
quadrupole: -1.4227 14.4725 -13.0497 -3.5711 -5.8654 -23.5402
hfenergy: -1252.0250386 hartree
pointgroup: C01 [X(C17H18N4O5)]
dipole: -1.5470616 1.4190181 1.4471596 debye
polarizability: 255.1384929|-0.7490661|222.67753|7.7705802|29.7289701|243.1716418 unknown
InChI: InChI=1S/C17H18N4O5/c1-8(2)25-17(22)13-9(3)18-10(4)16(21(23)24)14(13)11-6-5-7-12-15(11)20-26-19-12/h5-8,14,18H,1-4H3
charge 0 multiplicity 1
44 atoms
O  -2.574556 1.922923 0.165124
O  -1.883584 0.904571 -1.811127
O  0.583524 -2.761159 2.329984
O  4.382177 0.508667 -1.404478
O  2.650469 -0.071984 -2.778764
N  1.514827 1.473828 1.522663
N  3.108205 0.343044 -1.630289
N  0.703012 -1.544867 1.550823
N  0.223769 -3.893928 1.514243
C  0.687722 0.348151 -0.955228
C  -0.269551 1.135295 -0.04222
C  2.14275 0.625045 -0.595324
C  0.381218 -1.159198 -0.93222
C  0.151878 1.590424 1.192288
C  2.526916 1.086354 0.655885
C  0.418575 -1.941493 0.277597
C  -1.61483 1.296257 -0.639764
C  0.057272 -1.853769 -2.095745
C  -0.655783 2.231338 2.296889
C  3.930145 1.245662 1.189265
C  0.127679 -3.373637 0.259031
C  -0.229331 -3.270639 -2.11439
C  -0.201365 -4.047299 -0.9608
C  -3.953944 2.084086 -0.433209
C  -4.722651 0.764662 -0.276218
C  -4.580601 3.264032 0.313224
H  0.517969 0.671034 -1.996343
H  1.782116 1.705119 2.480795
H  0.021148 -1.29676 -3.036586
H  -0.225877 3.21097 2.580724
H  -0.636812 1.579093 3.192451
H  -1.696761 2.373289 1.989583
H  4.486151 2.008091 0.618219
H  4.504374 0.312796 1.075162
H  3.909961 1.535726 2.256035
H  -0.472454 -3.738056 -3.074262
H  -3.812153 2.313733 -1.505151
H  -0.414642 -5.118868 -0.965594
H  -5.744654 0.875478 -0.683069
H  -4.220599 -0.048012 -0.826526
H  -4.801904 0.484468 0.789281
H  -5.585285 3.47285 -0.096732
H  -3.964784 4.172988 0.202733
H  -4.687435 3.038495 1.389343
