program: Gaussian 09
title: 000122000
version: EM64L-G09RevD.01
frameworkgroup: C1[X(C17H17N3O)]
method: RPBEPBE
basis: SDD
operation: Freq
keyword: #p
keyword: freq=noraman
keyword: PBEPBE/SDD
title: #p freq=noraman PBEPBE/SDD
converged: YES YES NO NO
title: Mulliken charges:
elementType: O N N N C C C C C C C C C C C C C C C C C H H H H H H H H H H H H H H H H H
charge: -0.270641 -0.445212 -0.129197 -0.048939 0.361484 0.185684 -0.529944 0.159481 -0.397582 -0.380901 -0.049708 0.355613 -0.697714 -0.237979 -0.257157 -0.527109 -0.389944 0.346818 -0.218688 -0.379419 -0.537805 0.241600 0.203061 0.237021 0.225111 0.209167 0.216084 0.260499 0.336208 0.231030 0.232323 0.287292 0.262315 0.222517 0.241054 0.219512 0.219959 0.244106
chargesum: 0.00000
title: Mulliken charges with hydrogens summed into heavy atoms:
elementType: O N N N C C C C C C C C C C C C C C C C C
charge: -0.270641 -0.109004 -0.129197 -0.048939 0.361484 0.185684 -0.085283 0.159481 -0.160561 -0.155790 -0.049708 0.355613 -0.011964 -0.006948 -0.024834 -0.239817 -0.127629 0.346818 0.003829 -0.138365 0.145773
polarizability: 3.41978092e+02 -3.65175190e+00 2.22016723e+02 -7.73869940e+00 4.55497569e+00 1.03297407e+02
1716.lowfreq: -10.3723 -6.3280 -0.0006 -0.0005 -0.0001 1.1021 16.7033 37.6845 45.1020
frequency: 16.5886 37.6791 45.0668 70.8192 93.2154 95.3449 108.9256 139.8853 142.6083 202.6199 213.9301 220.8958 249.3176 255.9995 265.7247 294.4390 338.8305 341.6716 353.3358 430.1057 448.7281 457.9009 483.0778 524.2012 533.2609 549.9474 574.9776 584.2036 657.9626 669.8135 678.8137 693.7383 702.9022 742.8703 757.5667 773.8242 780.4141 789.9304 797.2799 814.8565 879.6576 889.7639 922.6298 937.6305 954.5598 965.6675 971.9563 977.4932 980.7795 990.9390 1007.2405 1031.2420 1058.6452 1062.9207 1065.2375 1086.8180 1091.8502 1111.6753 1127.9247 1146.0896 1157.3294 1178.1633 1179.4439 1207.5564 1213.4145 1232.9954 1244.6473 1272.1288 1293.4939 1308.1023 1317.6089 1348.3047 1379.5472 1381.9781 1394.2244 1406.0220 1428.0417 1431.9820 1459.8190 1465.9333 1466.3019 1472.8586 1475.8113 1477.9788 1491.0841 1508.4521 1538.3745 1579.8734 1586.8615 1612.1800 1626.2455 2956.6033 2982.0192 2996.8322 3043.2915 3064.5750 3080.7390 3100.7015 3118.2139 3123.6833 3123.7607 3134.2988 3142.7428 3162.1877 3164.0370 3172.1682 3175.9786 3609.1894
redmass: 4.0764 4.8941 4.7450 3.8297 2.9965 4.6501 3.9391 3.8632 4.0625 1.7084 4.4427 1.1138 4.8927 3.8552 1.7370 4.0800 3.9805 3.4037 5.4625 5.6802 3.2063 3.3044 4.4171 4.4388 4.5643 4.4301 3.9359 5.4801 6.1360 1.9121 4.0793 2.1991 2.2209 4.4909 2.1323 1.9907 2.6525 1.3297 1.6882 6.4197 1.4127 1.4107 1.5365 8.2201 1.3937 5.8127 2.8463 1.3347 5.9553 1.3402 5.8570 2.1587 2.3258 1.9211 2.2931 2.3330 1.7355 1.2603 3.0118 1.7968 1.4245 1.0762 1.1619 2.3634 3.0466 2.9525 1.5293 2.2418 1.4501 1.4284 2.2741 1.8510 3.6480 1.3732 8.3088 3.0854 2.0396 1.2977 2.0757 1.0505 1.2687 1.5049 1.1816 1.1768 1.0948 4.9079 4.9936 6.7654 6.2973 6.1657 6.7399 1.0331 1.0353 1.0635 1.1038 1.0979 1.0989 1.1010 1.0866 1.0989 1.0889 1.0871 1.0931 1.0917 1.1007 1.0960 1.0941 1.0826
irintensity: 0.0166 0.3890 0.4364 10.8103 1.3401 0.1303 0.3625 1.2247 0.5978 0.3263 0.9231 0.0722 0.2168 0.9971 0.5733 1.1889 1.6150 0.7508 3.6828 0.2052 3.2683 0.9024 3.4022 0.1343 16.2119 2.7001 1.5284 0.7364 2.3951 69.1385 15.5104 0.5411 32.6678 48.6041 43.9243 24.1254 3.8385 17.3733 38.3317 20.9017 0.5307 0.0092 24.2701 5.7230 1.6213 13.6698 5.5056 1.3043 8.0118 0.1284 96.0652 4.8745 16.2987 1.5754 5.6560 11.6804 22.6019 0.2497 11.4671 6.8232 3.7696 1.1688 9.2840 5.5163 102.0311 28.7887 7.9770 32.6433 4.2162 0.9976 3.9616 9.3757 4.9544 9.0490 16.6214 87.7964 27.0560 18.8989 97.8541 12.7011 42.9151 49.4905 2.4293 29.1293 17.0211 33.1799 7.5952 3.2449 66.4069 1.1834 54.0745 78.1669 37.6413 38.8135 50.8021 6.5393 37.9018 25.0153 13.4070 23.6625 4.4995 12.4985 24.8823 12.3073 32.5409 9.3268 5.7412 59.8310
temp: 298.150 k
press: 1.00000 atm
elementType: 8 7 7 7 6 6 6 6 6 6 6 6 6 6 6 6 6 6 6 6 6 1 1 1 1 1 1 1 1 1 1 1 1 1 1 1 1 1
symmnumber: 1
zpe: 798398.3 jmol-1
zpe.correction: 0.304094 hartree
zpe.thermalcorrener: 0.322626 hartree
zpe.thermalcorrenthalpy: 0.323570 hartree
zpe.thermalcorrgfe: 0.255801 hartree
zpe.sumelectzpe: -895.988788 hartree
zpe.sumelectthermal: -895.970256 hartree
zpe.sumelectthermalent: -895.969312 hartree
zpe.sumelectthermalfe: -896.037081 hartree
dipole: 0.9228 -0.2807 0.2297
dipole: 0.9915
quadrupole: -83.5470 -114.3689 -128.2560
quadrupole: -8.2591 -0.2324 2.1297
quadrupole: 25.1770 -5.6450 -19.5320 -8.2591 -0.2324 2.1297
hfenergy: -896.292882 hartree
pointgroup: C01 [X(C17H17N3O1)]
dipole: 0.3626823 0.1117442 -0.0902744 debye
polarizability: 342.0078529|3.7389293|221.9288598|7.147932|5.6762459|103.3555093 unknown
InChI: InChI=1S/C17H17N3O/c1-3-12-7-4-5-10-15(12)17-18-16(19-20-17)13-8-6-9-14(11-13)21-2/h4-11,20H,3H2,1-2H3
charge 0 multiplicity 1
38 atoms
O  -4.348231 -1.995545 0.258103
N  1.21801 2.17797 -0.187415
N  0.278429 0.174341 0.022942
N  -0.14548 2.443618 -0.2160
C  3.161712 -1.054932 -0.408812
C  2.836663 0.265204 0.040604
C  2.138253 -2.037093 -0.959647
C  1.474231 0.818388 -0.043778
C  4.515392 -1.471721 -0.314592
C  3.862318 1.099784 0.575105
C  -0.679861 1.185861 -0.081702
C  -2.128819 0.935325 -0.0515
C  1.526511 -2.930708 0.15412
C  5.526968 -0.637474 0.204353
C  5.196712 0.660719 0.656653
C  -2.601079 -0.388934 0.087665
C  -3.053233 2.012403 -0.16094
C  -3.992274 -0.642966 0.116585
C  -4.433331 1.744605 -0.129813
C  -4.920782 0.422006 0.008436
C  -5.77582 -2.316453 0.300325
H  1.312384 -1.504521 -1.46023
H  2.632996 -2.68164 -1.711436
H  4.772921 -2.478475 -0.665417
H  3.604402 2.090467 0.969133
H  2.311072 -3.481093 0.705232
H  0.830388 -3.668202 -0.285719
H  0.960304 -2.307395 0.866156
H  1.875221 2.943411 -0.321177
H  6.560852 -0.995495 0.259584
H  5.966338 1.316091 1.077886
H  -1.894855 -1.21917 0.173982
H  -2.677048 3.033835 -0.267785
H  -5.148763 2.570359 -0.213432
H  -5.999305 0.240508 0.029997
H  -6.285439 -2.018349 -0.637025
H  -6.273988 -1.831017 1.162535
H  -5.820469 -3.40951 0.414422
