program: Gaussian 09
title: 000122104
version: EM64L-G09RevD.01
frameworkgroup: C1[X(C24H26N2O6)]
method: RPBEPBE
basis: SDD
operation: Freq
keyword: #p
keyword: freq=noraman
keyword: PBEPBE/SDD
title: #p freq=noraman PBEPBE/SDD
converged: YES YES NO NO
title: Mulliken charges:
elementType: O O O O O O N N C C C C C C C C C C C C C C C C C C C C C C C C H H H H H H H H H H H H H H H H H H H H H H H H H H
charge: -0.268860 -0.252899 -0.289254 -0.219944 -0.229860 -0.239586 -0.141730 -0.377121 -0.226282 -0.473152 -0.468441 -0.340072 0.266302 0.155918 -0.200280 -0.594341 0.140419 0.247112 0.479579 -0.419104 -0.430439 -0.419745 -0.241420 -0.242743 -0.257563 0.483219 -0.499840 -0.355504 -0.440858 -0.227337 -0.223136 -0.239878 0.271677 0.233169 0.243216 0.263662 0.231199 0.245968 0.248946 0.352086 0.294661 0.241356 0.265576 0.249685 0.316021 0.249167 0.231800 0.226688 0.233312 0.226021 0.243802 0.244742 0.244111 0.265303 0.233266 0.231629 0.229008 0.230769
chargesum: 0.00000
title: Mulliken charges with hydrogens summed into heavy atoms:
elementType: O O O O O O N N C C C C C C C C C C C C C C C C C C C C C C C C
charge: -0.268860 -0.252899 -0.289254 -0.219944 -0.229860 -0.239586 -0.141730 -0.025035 0.045395 0.003234 0.026420 0.154842 0.266302 0.155918 0.094381 -0.087409 0.140419 0.247112 0.479579 -0.169419 -0.114418 0.061222 -0.014733 -0.009431 -0.031542 0.483219 0.232815 -0.090201 -0.207593 0.004291 0.005872 -0.009109
polarizability: 3.00124136e+02 3.35458915e+00 2.76242821e+02 9.28508999e+00 1.54167640e+01 2.67677349e+02
1716.lowfreq: -0.0003 -0.0001 0.0005 1.7047 3.1030 5.5221 12.6341 16.6036 27.2895
frequency: 12.5121 16.4322 27.2798 28.1431 33.3055 37.1234 42.9861 45.3854 49.8960 64.9293 69.4879 74.7617 78.1948 93.4294 112.0864 120.6595 132.4238 142.8622 166.5743 171.4237 196.1525 198.4714 216.6195 237.2084 245.4507 262.0372 277.3256 298.6977 311.8083 331.3828 337.5702 356.7548 366.2880 404.3790 407.8933 412.9357 437.3325 474.9860 490.1735 496.3110 520.4392 561.0165 572.1549 589.8519 594.9951 599.6147 616.4536 617.2292 628.1683 684.8084 704.5586 710.0454 714.7326 732.0176 747.9920 754.5857 756.4720 767.0473 788.5018 802.4006 825.4156 847.3928 855.5363 858.6941 868.4588 869.7134 880.3476 904.0793 914.4701 918.6192 923.1054 937.0755 943.5618 971.9706 975.4707 982.1285 984.6271 988.3656 989.7270 991.0466 994.6997 1002.8118 1009.1813 1026.5301 1027.1305 1063.1046 1079.1051 1089.8694 1093.2378 1104.1016 1112.2083 1142.1390 1144.0957 1148.3357 1166.5165 1170.5948 1171.2342 1173.3515 1188.8978 1190.7037 1191.7002 1196.5685 1203.9307 1212.4202 1224.4205 1228.9254 1235.9614 1244.4839 1262.4291 1298.8156 1303.7633 1324.0972 1328.4856 1333.4012 1339.1307 1343.8149 1350.7562 1354.4886 1378.0687 1380.5382 1387.0279 1420.8152 1441.1660 1441.6827 1453.8325 1459.6481 1463.0386 1467.7253 1469.0786 1473.9617 1480.2359 1484.6636 1487.4994 1488.6344 1572.7706 1589.6170 1595.3801 1610.2626 1611.1474 1612.5367 1616.8373 1641.9797 3006.6637 3009.0991 3013.1814 3013.6091 3017.8469 3026.4169 3029.9757 3032.3739 3078.3063 3078.8510 3083.7985 3086.9451 3106.5042 3109.0840 3116.3250 3119.2930 3125.4001 3128.4440 3137.3984 3139.2286 3146.9978 3150.3657 3158.5537 3160.3317 3165.3328 3544.7751
redmass: 5.2770 5.0340 5.7505 5.0372 4.7860 4.9655 5.8539 6.0664 5.3340 5.2135 5.1233 5.0413 5.9178 1.1780 3.3037 4.5416 4.0028 4.6428 3.7993 4.3394 5.3141 5.7671 5.2683 6.7869 3.0702 3.2409 3.1953 5.2652 6.1920 4.1002 5.2193 2.8529 3.1311 2.8188 2.9159 8.0009 3.6200 3.7810 4.2369 6.7017 4.7403 2.7704 3.8957 1.3814 5.1666 4.0249 6.2867 6.2154 4.5757 3.9420 1.9317 3.0624 4.2793 2.3600 4.3700 1.8496 3.0516 10.7697 3.5005 5.8610 3.5729 3.6839 2.6075 1.4184 1.9074 1.2587 3.0607 2.6930 2.6585 2.5609 1.5404 1.7429 2.5243 2.4661 3.3294 1.5728 2.0424 3.3553 1.6508 5.1163 2.2705 1.3512 1.3193 2.1857 2.2163 1.8446 1.9300 1.5451 1.8908 2.4018 1.2655 2.1771 2.2115 1.5031 2.0577 1.5131 1.1846 1.0545 1.2733 1.2751 2.9152 1.1872 1.4503 1.6072 1.8297 1.9779 1.2455 1.5177 1.6545 1.4736 1.3155 1.3321 1.4653 1.2926 1.2574 1.3613 1.5027 1.5495 6.5072 7.3653 6.5908 1.2186 2.1654 2.1595 1.0500 1.0506 1.0976 1.1227 1.0916 1.1125 1.0950 2.0881 2.3268 2.0986 11.3728 5.8496 6.0846 7.0362 7.9140 6.4189 6.0824 10.6376 1.0297 1.0672 1.0575 1.0614 1.0618 1.0787 1.0816 1.0652 1.1073 1.1038 1.1016 1.1024 1.1063 1.1046 1.0853 1.0872 1.0882 1.0868 1.0922 1.0918 1.0964 1.0965 1.1047 1.1014 1.1016 1.0780
irintensity: 0.1267 0.3330 1.7869 1.6798 0.7003 0.0428 1.4000 3.8942 1.9762 2.6084 3.7394 1.4478 1.9418 0.7796 0.3942 0.7708 3.6965 1.2014 4.5934 2.8680 3.8428 2.1011 9.1303 2.8714 2.4601 5.3253 5.2603 0.6846 15.5660 11.2988 13.6183 13.2444 0.9791 0.5644 0.0187 3.9893 0.1467 8.6630 11.0833 15.6824 13.6438 1.9686 15.6644 73.5821 3.7522 36.0790 3.9688 2.1381 14.9582 14.5659 41.8158 16.0303 15.8175 60.2386 0.7064 67.8630 18.6925 3.1433 7.9922 10.4034 15.1942 2.0674 18.2342 1.8056 4.8066 0.7567 2.1661 43.2616 1.2862 14.8747 2.4043 4.1324 6.1558 81.2790 17.4983 20.5374 39.0233 1.2402 0.1639 4.6098 10.7373 0.6454 2.0488 1.0222 4.9759 13.7692 25.8635 4.9286 3.7695 13.0615 0.1520 9.1471 224.1991 0.5839 123.4785 46.6684 22.0608 0.1705 6.7299 14.0930 178.9858 2.4443 54.7965 25.5132 41.3019 4.2561 4.2150 38.8675 7.2574 18.2228 6.9330 2.9891 2.6664 3.4222 2.5162 3.3904 6.2064 8.6578 38.6667 1.3174 0.6370 10.5850 10.5974 7.0755 14.5778 13.4644 37.2623 20.4681 21.3090 7.1018 2.0472 188.5985 36.7891 142.0392 325.2844 0.5851 0.3275 79.5791 147.1497 91.8197 0.6390 184.3264 30.6955 12.4253 19.1401 13.2879 24.6316 29.3527 9.8032 30.9817 12.5954 7.3910 11.0707 11.6532 31.0106 23.0154 1.0490 6.1950 10.3435 1.5795 35.7196 17.8726 2.4564 20.3918 11.1168 31.6811 24.8845 67.9923
temp: 298.150 k
press: 1.00000 atm
elementType: 8 8 8 8 8 8 7 7 6 6 6 6 6 6 6 6 6 6 6 6 6 6 6 6 6 6 6 6 6 6 6 6 1 1 1 1 1 1 1 1 1 1 1 1 1 1 1 1 1 1 1 1 1 1 1 1 1 1
symmnumber: 1
zpe: 1208594.7 jmol-1
zpe.correction: 0.460329 hartree
zpe.thermalcorrener: 0.491071 hartree
zpe.thermalcorrenthalpy: 0.492016 hartree
zpe.thermalcorrgfe: 0.392854 hartree
zpe.sumelectzpe: -1488.688769 hartree
zpe.sumelectthermal: -1488.658027 hartree
zpe.sumelectthermalent: -1488.657083 hartree
zpe.sumelectthermalfe: -1488.756245 hartree
dipole: 0.0399 -2.1034 3.4251
dipole: 4.0196
quadrupole: -167.4383 -169.0915 -191.1007
quadrupole: -7.6643 5.7602 1.1260
quadrupole: 8.4385 6.7853 -15.2239 -7.6643 5.7602 1.1260
hfenergy: -1489.1490989 hartree
pointgroup: C01 [X(C24H26N2O6)]
dipole: -0.0960568 -1.3093647 -0.8816566 debye
polarizability: 299.2685223|-1.8512116|263.1534311|9.3664525|-14.1633475|281.6223529 unknown
InChI: InChI=1S/C24H26N2O6/c1-31-24(30)22(28)26-14-8-13-20(26)21(27)25-19(15-17-9-4-2-5-10-17)23(29)32-16-18-11-6-3-7-12-18/h2-7,9-12,19-20,25H,8,13-16H2,1H3
charge 0 multiplicity 1
58 atoms
O  2.060032 -0.331238 2.589161
O  2.542215 0.123903 -1.019653
O  -2.556437 -0.395033 1.298655
O  5.134961 0.899161 -1.427847
O  5.828365 -1.290475 -1.055594
O  -2.850395 1.117939 3.053181
N  3.256848 -1.660719 0.277887
N  0.054045 -0.397888 1.41444
C  1.85984 -1.923633 0.709902
C  1.976772 -3.272821 1.472789
C  3.403797 -3.222946 2.073142
C  4.243712 -2.55153 0.962713
C  1.350783 -0.794934 1.641646
C  3.481571 -0.61166 -0.577902
C  -0.57926 0.626089 2.250779
C  -0.209589 2.093424 1.810809
C  4.938801 -0.404697 -1.024432
C  -2.099749 0.480598 2.282194
C  -0.761141 2.488331 0.449513
C  -1.980399 3.21172 0.355105
C  -0.0821 2.130415 -0.745982
C  -4.047957 -0.497122 1.122346
C  -2.513596 3.570456 -0.904065
C  -0.617966 2.487833 -2.005159
C  -1.833087 3.207728 -2.090526
C  -4.317869 -0.975009 -0.283377
C  6.493943 1.214527 -1.936737
C  -3.884672 -0.206614 -1.395332
C  -5.026688 -2.180445 -0.507488
C  -4.157125 -0.64326 -2.70926
C  -5.30882 -2.612615 -1.823979
C  -4.872936 -1.84507 -2.927857
H  1.207117 -1.988553 -0.179675
H  1.881814 -4.107891 0.754446
H  1.191454 -3.38465 2.238244
H  3.404152 -2.589468 2.975687
H  3.792426 -4.221725 2.33304
H  4.650015 -3.282987 0.241866
H  5.086562 -1.964754 1.360873
H  -0.471224 -0.738041 0.605904
H  -0.195999 0.501468 3.280856
H  -0.595919 2.767459 2.596414
H  0.89341 2.145374 1.827882
H  -2.506397 3.501059 1.273448
H  0.865212 1.581218 -0.700177
H  -4.465391 0.505183 1.328678
H  -4.426033 -1.201469 1.88348
H  -3.449674 4.138274 -0.958894
H  -0.076627 2.210932 -2.91693
H  -2.238063 3.494808 -3.067964
H  7.253229 0.973634 -1.173834
H  6.697865 0.632451 -2.851045
H  6.464948 2.291641 -2.147803
H  -3.330098 0.725024 -1.232552
H  -5.359433 -2.782762 0.347047
H  -3.814238 -0.04586 -3.561302
H  -5.861427 -3.544628 -1.986478
H  -5.087481 -2.179854 -3.94898
