program: Gaussian 09
title: 000121985
version: EM64L-G09RevD.01
frameworkgroup: C1[X(C10H10N2O5)]
method: RPBEPBE
basis: SDD
operation: Freq
keyword: #p
keyword: freq=noraman
keyword: PBEPBE/SDD
title: #p freq=noraman PBEPBE/SDD
converged: YES YES NO NO
title: Mulliken charges:
elementType: O O O O O N N C C C C C C C C C C H H H H H H H H H H
charge: -0.246881 -0.169241 -0.262224 -0.151290 -0.123396 -0.172533 0.206696 -0.428076 -0.309880 0.106822 0.220600 0.217500 -0.247534 -0.336519 -0.350723 -0.244830 -0.195515 0.288551 0.238996 0.237733 0.241599 0.249332 0.230147 0.272900 0.256554 0.235877 0.235334
chargesum: 0.00000
title: Mulliken charges with hydrogens summed into heavy atoms:
elementType: O O O O O N N C C C C C C C C C C
charge: -0.246881 -0.169241 -0.262224 -0.151290 -0.123396 -0.172533 0.206696 0.099471 0.169452 0.106822 0.220600 0.217500 0.231946 -0.063619 -0.094169 -0.008953 0.039819
polarizability: 1.88200507e+02 1.41018798e+01 1.42462051e+02 -1.36843347e+01 4.07339735e+00 9.66412712e+01
1716.lowfreq: -5.8271 -0.0010 -0.0008 -0.0007 3.4798 7.1385 21.7072 29.6267 35.4641
frequency: 21.5656 29.5593 35.4547 68.7412 112.0353 127.9413 161.7974 188.2632 199.5808 233.6354 278.3127 300.4693 341.1340 380.0730 422.0373 471.0502 474.4602 489.4369 520.2690 529.7682 578.3344 628.2730 641.3141 652.2060 678.5380 718.6012 752.2504 763.0203 781.5193 799.0734 829.8697 876.6717 880.3290 947.5305 967.1266 987.2434 994.2580 998.2285 1025.5714 1052.2366 1055.7438 1097.9600 1149.5612 1162.6893 1165.6132 1180.6461 1200.1393 1225.6060 1250.1943 1280.5651 1289.2440 1335.5192 1350.1650 1374.8533 1390.5385 1419.2413 1440.2716 1446.9324 1466.1980 1468.4772 1479.6223 1522.7897 1576.7117 1606.4046 1622.1053 2954.2925 2979.0968 3001.5689 3064.4476 3080.0012 3095.0264 3139.1255 3153.2582 3167.8684 3177.5799
redmass: 8.2653 6.8067 12.8442 6.8392 5.8374 6.7004 5.9678 3.7315 3.6822 5.1375 3.7216 3.4007 2.6981 5.2244 3.7711 5.2681 7.3511 6.1216 4.0249 5.6657 5.1047 5.6026 13.5465 5.9012 4.5012 5.6940 12.9275 2.4074 1.8224 5.0912 2.6485 3.2395 1.5864 7.1726 1.3756 2.6908 1.3628 2.9131 2.1262 2.0332 2.5012 2.0263 1.9879 2.4995 1.7306 1.6966 2.1133 1.3802 1.5078 1.5177 1.8551 1.7134 1.2955 1.3378 8.2352 1.7041 1.1256 2.2743 2.3642 1.1107 1.1476 13.2674 7.2573 9.2351 7.3487 1.0682 1.0654 1.0578 1.1051 1.0979 1.0977 1.0864 1.0903 1.0953 1.0999
irintensity: 1.1355 1.0001 0.0528 2.7474 3.8526 1.3545 1.8178 1.9238 3.7505 2.4479 0.8901 3.3284 16.1524 5.7820 1.2472 0.8150 3.4148 1.4456 7.9667 14.2186 5.4751 23.1480 6.7936 2.6863 24.9380 16.9120 228.2391 47.4811 41.4796 16.2633 32.6761 1.1159 0.6030 52.1865 4.0843 19.3164 1.3972 6.9638 26.8354 20.7676 5.2893 29.6243 52.8241 187.1686 89.9785 6.1317 24.3505 22.7677 101.7770 56.9269 39.1342 97.8971 1.0314 10.2768 6.6904 132.7613 43.8851 63.1969 5.0031 22.3385 15.4263 212.0853 24.9061 194.8608 96.5350 71.4010 31.4096 26.4829 17.8464 16.1469 18.9565 4.0067 5.8038 10.2228 15.4236
temp: 298.150 k
press: 1.00000 atm
elementType: 8 8 8 8 8 7 7 6 6 6 6 6 6 6 6 6 6 1 1 1 1 1 1 1 1 1 1
symmnumber: 1
zpe: 516235.5 jmol-1
zpe.correction: 0.196624 hartree
zpe.thermalcorrener: 0.211451 hartree
zpe.thermalcorrenthalpy: 0.212395 hartree
zpe.thermalcorrgfe: 0.152067 hartree
zpe.sumelectzpe: -871.314973 hartree
zpe.sumelectthermal: -871.300146 hartree
zpe.sumelectthermalent: -871.299202 hartree
zpe.sumelectthermalfe: -871.359530 hartree
dipole: 1.4378 -3.8241 -0.4224
dipole: 4.1073
quadrupole: -95.1215 -98.5534 -100.0264
quadrupole: 11.5299 -12.1929 -2.9435
quadrupole: 2.7789 -0.6530 -2.1259 11.5299 -12.1929 -2.9435
hfenergy: -871.511597 hartree
pointgroup: C01 [X(C10H10N2O5)]
dipole: 0.6415717 -1.3860596 -0.5276688 debye
polarizability: 187.1774034|18.8073837|138.9852897|-7.6839446|15.0414994|101.141136 unknown
InChI: InChI=1S/C10H10N2O5/c13-10-8-3-1-2-4-9(8)16-7-11(10)5-6-17-12(14)15/h1-4H,5-7H2
charge 0 multiplicity 1
27 atoms
O  1.558393 -1.782441 -0.816091
O  -2.989191 0.24112 0.074069
O  0.011228 0.837068 1.997254
O  -4.937998 -0.45191 -1.111221
O  -4.37596 1.770546 -0.979213
N  -0.31147 -0.926528 0.486075
N  -4.230138 0.543827 -0.759281
C  -1.543316 -1.369205 1.149957
C  0.109312 -1.519867 -0.784664
C  1.726813 0.389571 0.326356
C  0.40952 0.168176 0.9975
C  2.29687 -0.620135 -0.497849
C  -2.82328 -1.2151 0.309708
C  2.495382 1.540561 0.627682
C  3.615793 -0.51345 -0.982977
C  3.802836 1.676174 0.122612
C  4.362786 0.642741 -0.672391
H  -1.62771 -0.773225 2.07496
H  -1.4641 -2.440469 1.426433
H  -0.37392 -2.499123 -0.924899
H  -0.125519 -0.84647 -1.636389
H  -3.689969 -1.608079 0.872231
H  -2.765945 -1.741716 -0.661391
H  2.049528 2.297184 1.2816
H  4.027446 -1.317751 -1.599453
H  4.391635 2.569371 0.353643
H  5.383975 0.74103 -1.056562
