program: Gaussian 09
title: 000121983
version: EM64L-G09RevD.01
frameworkgroup: C1[X(C2H8O9P2)]
method: RPBEPBE
basis: SDD
operation: Freq
keyword: #pfreq=noraman
keyword: PBEPBE/SDD
title: #p freq=noraman PBEPBE/SDD
converged: NO NO NO NO
title: Mulliken charges:
elementType: P P O O O O O O O O O C C H H H H H H H H
charge: 1.377490 1.359842 -0.491751 -0.462469 -0.539742 -0.641944 -0.726616 -0.637486 -0.655729 -0.536207 -0.586957 0.330035 -0.637718 0.233666 0.263673 0.251893 0.433329 0.407123 0.417910 0.404622 0.437034
chargesum: 0.00000
title: Mulliken charges with hydrogens summed into heavy atoms:
elementType: P P O O O O O O O O O C C
charge: 1.377490 1.359842 -0.491751 -0.462469 -0.106413 -0.234820 -0.308707 -0.232864 -0.218695 -0.536207 -0.586957 0.330035 0.111515
polarizability: 1.22257940e+02 -2.85597739e+00 9.75457409e+01 2.99566876e+00 5.94191767e-01 8.37667003e+01
1716.lowfreq: -24.9144 -1.9935 0.0011 0.0012 0.0024 2.5941 9.9253 39.1239 46.7606
frequency: -24.6426 38.9647 46.5861 91.6229 127.5762 159.8287 164.6988 180.3497 205.3480 224.8569 234.8273 249.3368 256.4035 271.8503 298.3954 320.3728 331.7369 335.7338 338.7588 364.8217 370.5744 390.0035 439.3568 455.6134 548.1592 569.1001 593.3967 632.1980 638.5554 687.4589 709.6329 751.1276 782.0168 823.5095 854.3621 871.6321 1027.5262 1028.4066 1036.9354 1075.7622 1083.0488 1098.4775 1106.5477 1170.5674 1212.5248 1346.4564 1401.0491 1453.1894 1460.4866 3015.1249 3121.6175 3132.2321 3288.9583 3393.8155 3584.6891 3588.4379 3611.9942
redmass: 7.8481 9.7774 7.9137 6.6841 6.9390 3.8198 5.6554 2.1824 3.7662 1.6951 1.5828 2.1583 2.2254 2.3703 3.6721 2.9216 4.6259 3.6415 3.1084 4.5610 5.3067 3.6040 7.7563 2.2724 2.9539 4.8266 1.2677 5.8298 6.0975 9.5788 12.9477 6.9816 7.4826 4.9774 4.5466 5.2454 1.6797 1.8854 1.1975 2.1059 2.7792 1.7939 1.9758 5.2381 1.3649 1.2491 1.2204 1.0466 1.0511 1.0355 1.1010 1.1012 1.0651 1.0670 1.0663 1.0662 1.0665
irintensity: 6.6005 0.4974 0.1221 9.1182 8.2129 38.7633 6.2975 20.5549 18.1259 16.0238 8.0919 27.6305 81.1325 96.6228 41.3567 124.5412 25.4406 77.3920 37.8663 37.1790 63.2825 78.4645 51.6467 41.9088 49.7565 42.6820 130.1254 93.1459 14.0999 166.9223 252.3225 228.1009 139.6888 148.1769 481.4079 133.1901 17.0381 3.7286 102.0889 62.6947 219.0816 234.0236 96.0304 221.1520 18.8262 270.6214 31.0441 13.0639 1.8683 3.7508 2.5089 7.7167 309.4865 163.6484 104.1097 93.6115 82.9133
temp: 298.150 k
press: 1.00000 atm
elementType: 15 15 8 8 8 8 8 8 8 8 8 6 6 1 1 1 1 1 1 1 1
symmnumber: 1
zpe: 338522.9 jmol-1
zpe.correction: 0.128937 hartree
zpe.thermalcorrener: 0.144911 hartree
zpe.thermalcorrenthalpy: 0.145856 hartree
zpe.thermalcorrgfe: 0.086294 hartree
zpe.sumelectzpe: -1439.401451 hartree
zpe.sumelectthermal: -1439.385477 hartree
zpe.sumelectthermalent: -1439.384532 hartree
zpe.sumelectthermalfe: -1439.444094 hartree
dipole: 5.0137 1.3904 -0.2494
dipole: 5.2089
quadrupole: -86.8547 -99.2827 -79.3534
quadrupole: 0.6664 9.8604 3.7527
quadrupole: 1.6422 -10.7857 9.1435 0.6664 9.8604 3.7527
hfenergy: -1439.5303879 hartree
pointgroup: C01 [X(C2H8O9P2)]
dipole: 1.976279 0.5372484 -0.0742548 debye
dipolederiv: 2.5069669 -0.2034331 -0.1519743 -0.4673302 1.6824575 0.1425594 0.2332851 0.0212547 1.8134679 2.5226535 0.3519383 0.2023838 0.381245 1.7667161 0.1428061 -0.0088441 0.0194511 1.7342802 -1.7920392 0.3072517 0.0359143 0.5013447 -0.7317877 0.0029676 -0.0331333 -0.0271574 -0.5282357 -1.6624481 -0.3741639 -0.0402433 -0.7373049 -0.7974079 0.023162 -0.0816991 0.0428576 -0.5708989 -0.7705797 0.1264538 -0.0826666 -0.0216611 -0.6562265 0.0098204 -0.0092299 -0.0718508 -0.9375573 -1.1236736 0.0739503 0.272544 0.0403324 -0.4703071 0.1647187 0.279812 0.1215498 -0.6720345 -0.7879502 -0.0936205 -0.0821164 -0.0960908 -0.6496057 -0.264112 -0.1558801 -0.161547 -0.9666184 -0.6862484 -0.2027943 0.0200038 -0.3330501 -0.8978245 -0.2728304 -0.0173419 -0.264535 -0.5669792 -0.7771438 0.0174924 -0.176833 0.018287 -0.5816694 0.0237518 -0.0407592 0.0190173 -0.9034708 -0.6886748 0.0850172 0.0119838 0.0896319 -0.668849 -0.0008639 -0.0179626 0.0257811 -0.5563966 -0.8163115 0.0111466 -0.0418264 -0.0400066 -0.6753205 -0.0289969 -0.0348118 0.0319416 -0.5950669 2.1228723 -0.2258579 0.1621627 0.6527399 1.1263019 -0.064117 0.1160237 0.1806023 1.0562272 -0.251914 0.1482485 -0.045952 0.0085807 -0.226879 0.1003023 0.0323047 0.0261962 -0.0443387 0.0362438 -0.1118811 -0.0520082 -0.1058234 0.0057736 -0.0283494 -0.0535291 -0.0458403 0.073318 0.0078602 0.0540515 0.0344549 0.0659588 0.1006482 0.0133335 0.026139 0.0174718 0.0929147 0.1283397 -0.0021545 0.0190993 0.0017772 0.0993513 -0.0275196 0.0136735 -0.0004125 -0.0583565 0.4549962 -0.167894 0.0265091 -0.1799672 0.393896 0.0422616 0.0336309 0.0366824 0.3251079 0.4006164 -0.0278156 -0.0084208 -0.0845335 0.2251302 -0.085559 -0.0606158 -0.1112932 0.3157715 0.3110129 0.1133006 -0.0169365 0.1159218 0.278092 0.0138038 -0.0627111 0.0564756 0.3502003 0.332918 0.0963482 -0.0957783 0.0816201 0.3212128 0.0634484 -0.0714172 0.1024519 0.2812301 0.5325033 0.0244157 0.0097001 0.1083283 0.3562977 0.0294125 -0.0869337 -0.0190972 0.3574358 unknown
polarizability: 121.8948935|-2.3466562|97.4724047|5.042523|-1.1707662|84.2030835 unknown
InChI: InChI=1S/C2H8O9P2/c1-2(3,10-12(4,5)6)11-13(7,8)9/h3-5,7-8H,1H3
charge 0 multiplicity 1
21 atoms
P  2.239181 -0.563287 0.143151
P  -2.655883 -0.406835 -0.022309
O  1.192566 0.587027 -0.620287
O  -1.000095 -0.225684 -0.637461
O  -0.251238 0.839088 1.29673
O  3.714306 -0.144661 -0.619417
O  2.383813 0.314149 1.631977
O  -3.00204 -1.9646 -0.607108
O  -2.42782 -0.716801 1.627902
O  1.918856 -2.10822 0.233046
O  -3.652323 0.749471 -0.454996
C  -0.175125 0.860353 -0.169122
C  -0.54828 2.212018 -0.764913
H  0.121835 2.996228 -0.378748
H  -1.591644 2.448482 -0.497285
H  -0.462609 2.168168 -1.861803
H  0.628291 1.071844 1.713265
H  3.984397 -0.76808 -1.342762
H  2.987176 -0.073153 2.314277
H  -3.627713 -1.968363 -1.376767
H  -1.595651 -0.237244 1.939131
