program: Gaussian 09
title: 000121947
version: EM64L-G09RevD.01
frameworkgroup: C1[X(C7H11O8P)]
method: RPBEPBE
basis: SDD
operation: Freq
keyword: #p
keyword: freq=noraman
keyword: PBEPBE/SDD
title: #p freq=noraman PBEPBE/SDD
converged: YES YES NO NO
title: Mulliken charges:
elementType: P O O O O O O O O C C C C C C C H H H H H H H H H H H
charge: 1.385494 -0.540975 -0.456428 -0.451067 -0.429553 -0.652351 -0.658671 -0.245495 -0.625528 -0.259265 -0.167952 0.033866 -0.464962 0.297183 -0.329330 0.077976 0.244581 0.241224 0.262875 0.257583 0.262198 0.283531 0.391920 0.344195 0.383320 0.407859 0.407772
chargesum: 0.00000
title: Mulliken charges with hydrogens summed into heavy atoms:
elementType: P O O O O O O O O C C C C C C C
charge: 1.385494 -0.540975 -0.064508 -0.106872 -0.046233 -0.244492 -0.250899 -0.245495 -0.625528 -0.014684 0.073271 0.296742 0.054820 0.297183 -0.045800 0.077976
polarizability: 1.68636166e+02 -4.33521654e-01 1.16480985e+02 9.04889928e+00 2.57821279e+00 9.45066764e+01
1716.lowfreq: -5.0860 -0.0011 -0.0002 0.0002 4.4026 11.8192 35.2840 44.5781 56.2564
frequency: 35.2733 44.5409 56.2537 79.7545 98.8495 125.3208 139.8879 147.5050 171.2663 207.9837 217.4641 221.4581 242.1697 262.0891 295.4696 312.2553 329.9705 339.9662 359.3433 376.3896 395.5511 417.9709 478.0040 485.4705 507.9411 582.7428 604.2968 628.0879 662.6625 678.6840 690.8249 736.6001 752.1187 767.4857 818.9251 835.8407 897.4628 908.2892 931.6960 953.7381 1002.8132 1010.0546 1012.8008 1019.0645 1030.2074 1043.8753 1076.3830 1119.3727 1147.6594 1182.4046 1194.3304 1236.0319 1257.0647 1273.4705 1292.2135 1310.8294 1322.1791 1356.1134 1380.4342 1383.2487 1408.2018 1429.1599 1633.1614 1672.4517 2936.4617 3001.1573 3005.3492 3020.5915 3076.5036 3150.1464 3314.1126 3522.5256 3567.2740 3596.2590 3599.0078
redmass: 7.9639 6.5335 9.3752 4.7438 8.5104 4.1297 2.2990 3.2024 4.8260 2.7091 4.5049 2.7334 4.5924 1.3286 2.4623 2.8011 4.9387 5.2227 6.2299 6.4651 2.7831 5.6514 5.5434 6.8312 4.6227 4.8262 1.2847 7.2326 4.1778 1.6922 1.9073 5.9028 4.9747 7.1564 3.8923 3.6541 2.9116 1.6471 3.4087 4.2925 4.2320 3.4851 2.5029 1.4936 2.8787 1.6259 1.9130 1.6345 2.2489 1.1874 1.1060 1.1508 1.2826 1.2617 1.6625 1.6588 1.5813 1.4713 2.3095 1.5245 1.3926 1.1045 8.7596 8.0787 1.0835 1.0824 1.0784 1.0707 1.0981 1.0919 1.0673 1.0640 1.0664 1.0664 1.0665
irintensity: 0.8316 2.1238 1.5182 2.8923 0.9000 10.1480 50.3071 10.8424 9.4604 55.7899 9.9759 62.2775 17.1229 132.9695 75.0835 12.8807 25.6636 21.2774 47.0819 115.9290 13.4090 6.9538 3.0353 19.4223 8.7287 24.9659 85.3400 38.4049 53.5283 77.6894 51.5809 67.1926 241.2085 189.2127 53.5370 124.0293 43.9798 35.9461 145.4467 91.7841 55.6400 28.2495 37.9053 188.3514 6.9902 185.4275 145.5503 184.6695 10.7396 3.5228 39.5548 11.6582 15.3956 29.0847 73.3374 23.0419 14.1190 12.5022 28.7062 1.9926 20.8219 32.6838 234.3525 10.0034 52.0820 7.3483 24.4557 22.6475 4.0037 0.3115 271.4577 41.1617 6.9207 99.8798 78.2759
temp: 298.150 k
press: 1.00000 atm
elementType: 15 8 8 8 8 8 8 8 8 6 6 6 6 6 6 6 1 1 1 1 1 1 1 1 1 1 1
symmnumber: 1
zpe: 498726.3 jmol-1
zpe.correction: 0.189955 hartree
zpe.thermalcorrener: 0.207473 hartree
zpe.thermalcorrenthalpy: 0.208417 hartree
zpe.thermalcorrgfe: 0.144313 hartree
zpe.sumelectzpe: -1215.086632 hartree
zpe.sumelectthermal: -1215.069114 hartree
zpe.sumelectthermalent: -1215.068170 hartree
zpe.sumelectthermalfe: -1215.132274 hartree
dipole: -2.6412 2.3076 -0.0521
dipole: 3.5076
quadrupole: -83.5817 -95.4304 -107.7397
quadrupole: 2.0934 5.5437 -9.8862
quadrupole: 12.0022 0.1535 -12.1558 2.0934 5.5437 -9.8862
hfenergy: -1215.2765871 hartree
pointgroup: C01 [X(C7H11O8P1)]
dipole: -1.06033 0.8662151 -0.1725481 debye
polarizability: 167.7548416|2.2643003|116.8682613|11.8235754|0.1739781|95.0007237 unknown
InChI: InChI=1S/C7H11O8P/c8-4-1-3(7(10)11)2-5(6(4)9)15-16(12,13)14/h2,4-6,8-10,12-13H,1H2
charge 0 multiplicity 1
27 atoms
P  -3.190762 -0.511371 0.028129
O  -1.628235 -1.034605 -0.367227
O  -0.655915 1.114805 1.546105
O  0.979969 2.21643 -1.601457
O  4.187931 -0.424731 0.757833
O  -4.061938 -1.976664 0.100474
O  -3.758491 0.130597 -1.448317
O  3.167967 -2.388946 0.054298
O  -3.329791 0.42627 1.313593
C  -0.545453 1.257962 0.104895
C  0.789108 2.003535 -0.150581
C  -0.485226 -0.090696 -0.666396
C  1.995427 1.200725 0.357407
C  1.902321 -0.281332 0.053315
C  0.75755 -0.879649 -0.379994
C  3.090586 -1.153842 0.265163
H  -1.390656 1.85821 -0.302962
H  0.740707 2.970762 0.387642
H  -0.551871 0.132812 -1.750008
H  2.06747 1.329947 1.453315
H  2.913585 1.630025 -0.078261
H  0.731993 -1.959344 -0.566513
H  -1.620213 0.95047 1.772915
H  0.386645 2.949134 -1.904774
H  4.952052 -1.049126 0.886483
H  -3.98714 -2.473029 0.955014
H  -4.710021 0.405651 -1.465092
