program: Gaussian 09
title: 000122108
version: EM64L-G09RevD.01
frameworkgroup: C1[X(C8H15N4O14P3)]
method: RPBEPBE
basis: SDD
operation: Freq
keyword: #p
keyword: freq=noraman
keyword: PBEPBE/SDD
title: #p freq=noraman PBEPBE/SDD
converged: NO YES NO NO
title: Mulliken charges:
elementType: P P P O O O O O O O O O O O O O O N N N N C C C C C C C C H H H H H H H H H H H H H H H
charge: 1.401428 1.462191 1.460210 -0.224205 -0.481517 -0.434949 -0.493018 -0.738341 -0.659734 -0.566228 -0.734578 -0.223056 -0.642794 -0.642815 -0.672428 -0.635395 -0.768389 -0.134735 0.001521 -0.389251 -0.628776 -0.177121 -0.166650 -0.073096 -0.078342 -0.311717 0.010916 0.133245 0.173829 0.245706 0.306275 0.286169 0.311827 0.235402 0.270327 0.378570 0.385639 0.333711 0.441151 0.412222 0.347356 0.443678 0.426059 0.409702
chargesum: 0.00000
title: Mulliken charges with hydrogens summed into heavy atoms:
elementType: P P P O O O O O O O O O O O O O O N N N N C C C C C C C C
charge: 1.401428 1.462191 1.460210 -0.224205 -0.102947 -0.049310 -0.493018 -0.738341 -0.218583 -0.566228 -0.734578 -0.223056 -0.199116 -0.642815 -0.672428 -0.225693 -0.768389 -0.134735 0.001521 0.036808 0.130801 0.068586 0.139625 0.213072 0.233485 0.194013 0.344627 0.133245 0.173829
polarizability: 2.84215033e+02 -8.01225756e+00 2.33566887e+02 2.59499878e+00 8.40641320e+00 1.73339984e+02
1716.lowfreq: -4.2614 -0.0013 -0.0011 0.0006 2.9740 4.5673 19.1823 34.3548 37.4837
frequency: 18.8102 34.3232 37.4187 42.1446 54.1972 56.9974 67.6671 82.5322 90.1841 97.6199 109.0404 113.8721 131.5271 140.8389 149.5491 160.6790 171.3227 172.3466 179.7027 189.3388 207.5903 209.0300 218.0415 224.4491 233.2044 246.5754 267.3011 274.9910 291.9648 305.3035 308.9951 326.0597 334.2662 345.4165 352.7153 358.7185 375.9746 381.2056 402.3514 424.8022 434.4238 445.7211 461.0172 501.5282 524.0440 536.6516 544.0140 572.0050 585.7608 589.0294 623.6181 654.4347 677.8803 690.2355 698.0373 704.4573 709.0268 721.8215 732.7342 736.3375 766.7985 785.0820 792.7969 802.6041 822.3651 835.3659 845.6873 860.6785 885.5785 904.6416 932.0513 938.3957 962.0069 971.6158 975.7894 988.3289 1012.9201 1020.4915 1027.3218 1045.7896 1052.0670 1055.6979 1061.8909 1065.0016 1098.6169 1111.8804 1149.9822 1177.8997 1219.1401 1230.8780 1232.0323 1237.6831 1240.8042 1250.3879 1271.7483 1289.7150 1310.1724 1311.6632 1321.5064 1332.0035 1338.1013 1359.6424 1370.7002 1385.4981 1403.3341 1419.6783 1469.1704 1486.8288 1546.3313 1599.2905 1664.9296 2006.2823 2605.7252 2985.1906 3024.6455 3032.9738 3045.4790 3071.7356 3081.4877 3094.7209 3248.4143 3277.0360 3416.4817 3582.6990 3588.0551 3622.2577
redmass: 10.8494 8.8490 13.1865 6.9966 9.5544 10.7732 7.3642 8.5506 8.7770 7.4728 5.1964 2.8206 4.6341 5.8724 5.1093 7.9738 5.7969 6.0456 1.6964 2.9883 5.0337 6.4704 5.4399 7.8161 8.8322 5.4981 7.9927 6.9354 6.1568 5.9404 8.9630 7.4059 4.5042 12.4454 8.7196 7.4418 9.9617 8.4319 8.3716 10.3797 8.7619 10.1748 9.1411 4.8244 1.9083 3.1684 2.5639 5.5793 3.4459 2.6075 3.7786 3.6620 9.0372 3.4188 2.2117 2.0203 5.5810 7.0933 7.8703 6.1096 7.8569 12.7915 3.5696 8.5544 3.9105 2.8073 1.1229 1.5769 5.5009 1.3866 2.8369 3.7810 5.5994 4.6825 3.7501 2.2984 5.8600 7.8907 3.0542 1.8212 3.6796 2.6933 2.6528 3.9670 4.1436 2.7359 1.1837 1.8779 1.4582 1.2114 1.3786 1.4592 2.1810 1.2883 1.4044 1.3091 2.1025 1.3463 1.4153 1.5093 1.3993 2.4520 1.2769 1.3188 1.2015 3.7993 1.0776 4.6649 1.5699 3.0013 1.5566 1.2271 1.0709 1.0570 1.0873 1.0688 1.1053 1.0874 1.0872 1.0897 1.0712 1.1040 1.0641 1.0846 1.0670 1.0675
irintensity: 1.9122 3.9102 0.2427 4.8783 0.9104 0.8430 3.0501 1.8391 2.8757 0.9783 4.5712 40.3521 18.9026 6.4414 30.6884 9.8072 6.2271 38.6435 68.4407 48.5593 35.1098 25.0117 4.7402 2.3975 11.5362 24.4187 2.0920 7.4063 18.8969 7.3811 7.1662 10.6139 19.1995 5.9364 14.9277 2.6267 48.9916 80.8495 52.2340 133.6068 43.7467 10.0322 13.7154 23.8075 57.2610 51.6477 29.9946 42.7358 71.5588 32.1555 4.4270 47.2425 430.1613 20.0138 7.1954 427.5051 35.7286 42.3077 13.0117 188.8702 8.7464 122.4252 24.0073 237.6716 29.8670 11.1173 63.4551 33.9802 241.6162 138.0107 213.7932 732.0966 88.5893 63.7068 43.7200 1.1957 17.6857 316.0080 68.6715 61.7013 58.5719 82.2582 176.0381 50.3572 11.3075 52.8760 51.3936 24.0365 2.1266 145.5424 65.5135 6.7438 115.4459 21.1505 20.5798 23.1956 184.6402 187.2977 12.7726 29.9366 39.0584 7.6200 0.9458 13.3143 58.8235 66.9762 15.5590 1.3204 103.0100 84.9529 237.6989 3205.8132 814.7353 30.7192 19.5188 472.7161 12.9942 6.8431 5.1551 11.1222 731.2203 29.5799 84.2212 86.5203 102.8198 46.4079
temp: 298.150 k
press: 1.00000 atm
elementType: 15 15 15 8 8 8 8 8 8 8 8 8 8 8 8 8 8 7 7 7 7 6 6 6 6 6 6 6 6 1 1 1 1 1 1 1 1 1 1 1 1 1 1 1
symmnumber: 1
zpe: 749195.0 jmol-1
zpe.correction: 0.285353 hartree
zpe.thermalcorrener: 0.316023 hartree
zpe.thermalcorrenthalpy: 0.316967 hartree
zpe.thermalcorrgfe: 0.223148 hartree
zpe.sumelectzpe: -2607.421269 hartree
zpe.sumelectthermal: -2607.390600 hartree
zpe.sumelectthermalent: -2607.389655 hartree
zpe.sumelectthermalfe: -2607.483475 hartree
dipole: 5.6029 -1.5398 -1.5398
dipole: 6.0112
quadrupole: -160.5700 -226.4526 -205.4297
quadrupole: -34.9597 -2.3451 -2.6373
quadrupole: 36.9141 -28.9684 -7.9456 -34.9597 -2.3451 -2.6373
hfenergy: -2607.7066227 hartree
pointgroup: C01 [X(C8H15N4O14P3)]
dipole: 2.2905812 -0.2634416 0.5263102 debye
polarizability: 283.0904972|-10.3890622|232.6742867|-3.1673816|14.107076|175.3571197 unknown
InChI: InChI=1S/C8H15N4O14P3/c9-6(15)7-10-2-12(11-7)8-5(14)4(13)3(24-8)1-23-28(19,20)26-29(21,22)25-27(16,17)18/h2-5,8,10,13-14,16,19,21H,1,9H2
charge 0 multiplicity 1
44 atoms
P  0.470003 2.889806 -0.226487
P  -2.588757 2.800042 0.164632
P  -3.965174 0.15433 0.993854
O  2.932325 -0.580903 1.504726
O  5.659081 -0.883739 0.186471
O  4.480935 -3.088609 -0.343786
O  1.564336 1.806113 0.55991
O  -1.041896 1.995293 0.0039
O  0.343484 4.153047 0.886051
O  0.852374 3.175332 -1.735313
O  -3.362456 1.80469 1.342551
O  -1.322954 -4.159795 -1.968668
O  -3.432803 2.521221 -1.25852
O  -2.353014 4.309973 0.60402
O  -3.120484 -0.97618 1.754634
O  -5.480552 0.243107 1.753637
O  -3.953723 0.075391 -0.635446
N  1.213267 -1.922568 0.557583
N  0.698636 -2.584202 -0.564018
N  -0.954273 -1.747453 0.743292
N  -2.794682 -2.383735 -1.601004
C  4.359066 -0.588439 -0.419017
C  3.585289 -1.962195 -0.410062
C  3.500821 0.338492 0.473812
C  2.686856 -1.854978 0.866888
C  2.436376 1.048952 -0.368377
C  0.218986 -1.420144 1.335645
C  -0.644417 -2.451429 -0.42388
C  -1.62277 -3.069527 -1.400988
H  4.478723 -0.199595 -1.447938
H  2.964646 -2.089101 -1.311312
H  4.090737 1.073325 1.043805
H  2.920082 -2.661958 1.579479
H  1.826802 0.337663 -0.959316
H  2.927639 1.743957 -1.076694
H  6.334681 -0.205279 -0.052053
H  5.343039 -2.745756 0.030751
H  0.354451 -0.841722 2.24381
H  -0.60812 4.527171 0.939858
H  -3.064109 -1.456112 -1.219374
H  -3.463363 -2.827103 -2.234295
H  -3.745483 1.517578 -1.293976
H  -1.95973 -1.457973 1.173548
H  -5.967075 1.10041 1.646165
