program: Gaussian 09
title: 000121939
version: EM64L-G09RevD.01
frameworkgroup: C1[X(C7H14F2N4O2)]
method: RPBEPBE
basis: SDD
operation: Freq
keyword: #p
keyword: freq=noraman
keyword: PBEPBE/SDD
title: #p freq=noraman PBEPBE/SDD
converged: YES YES NO NO
title: Mulliken charges:
elementType: F F O O N N N N C C C C C C C H H H H H H H H H H H H H H
charge: -0.178327 -0.201850 -0.388753 -0.227333 -0.620533 -0.107934 -0.633296 -0.659791 0.159031 -0.442723 -0.385190 0.066402 -0.461208 0.121705 0.212862 0.294284 0.203532 0.227607 0.169787 0.229171 0.195293 0.202201 0.304386 0.276835 0.381572 0.322159 0.293167 0.311330 0.335613
chargesum: 0.00000
title: Mulliken charges with hydrogens summed into heavy atoms:
elementType: F F O O N N N N C C C C C C C
charge: -0.178327 -0.201850 -0.007181 -0.227333 -0.039312 -0.107934 -0.017970 -0.012848 0.159031 0.055093 0.012204 0.295573 -0.063714 0.121705 0.212862
polarizability: 1.40642534e+02 1.34078018e+01 1.08757482e+02 -1.92525529e+00 8.21574444e+00 9.14673863e+01
1716.lowfreq: -11.9373 -8.3075 -0.0007 0.0003 0.0007 6.7838 21.5446 28.0109 40.6512
frequency: 20.8552 27.8367 40.6435 45.4578 69.8654 88.9607 128.5940 151.0307 166.4071 185.1020 196.7393 233.0138 257.2336 273.7979 321.2685 338.8469 355.9475 378.2072 396.4117 417.0546 426.9690 466.9230 473.4115 488.0924 541.4932 552.2220 570.8397 583.0119 629.8646 677.9318 687.1491 696.2064 752.8960 774.8860 857.3661 880.2967 955.1916 962.5331 969.4716 990.3617 1024.1244 1030.0982 1036.8258 1048.7805 1085.8434 1125.0507 1170.5811 1183.0372 1210.1773 1243.0923 1258.9693 1276.7890 1292.2203 1296.8055 1317.4248 1342.5701 1354.8360 1373.0440 1411.4790 1450.8566 1458.3879 1470.2478 1601.6615 1614.9581 1645.1498 1651.8388 1672.1055 2871.5090 2915.8745 2971.8444 2987.4957 3039.3002 3089.0222 3098.0000 3469.8265 3501.7810 3523.7933 3552.2411 3592.8020 3671.4381 3698.3248
redmass: 5.0389 4.0828 6.6999 11.3875 7.1275 4.6391 4.7670 4.0723 3.4405 3.4940 1.3192 4.4116 3.4822 2.0261 4.2155 3.5316 1.3508 4.6463 1.4203 1.3519 1.5261 2.3228 6.6402 2.9571 3.3156 2.6134 1.4128 3.6520 1.5943 5.0351 1.7140 2.7654 1.9720 2.7345 2.4909 2.5338 3.9040 3.0078 3.8983 3.2419 2.1533 1.4610 2.5820 2.9425 2.4466 2.2290 2.4185 2.1277 1.4518 1.4694 1.4113 1.6154 1.2854 1.2603 1.3395 1.6310 1.3945 1.4632 4.3091 1.0913 1.0884 1.0893 1.2221 1.2736 9.7680 1.0944 3.6892 1.0550 1.1017 1.0627 1.0681 1.0973 1.0891 1.0950 1.0459 1.0641 1.0450 1.0454 1.0964 1.1019 1.1028
irintensity: 0.1455 3.7773 0.1266 1.5396 1.1954 1.6929 2.6540 0.7963 3.6530 7.8183 35.0984 5.4600 4.0619 3.6075 2.2750 10.2245 86.5136 10.1461 175.8828 152.0598 17.2274 12.9986 22.7899 7.2700 6.9323 102.4249 177.9955 3.5049 139.5149 73.1685 277.6506 17.0911 18.3605 20.0405 14.9113 10.9819 65.8574 21.6706 73.0467 12.8997 32.3521 7.7395 23.6515 242.3707 0.3051 11.9057 16.9584 3.0713 5.5235 10.3881 7.7150 17.3619 7.0214 4.2444 7.0356 4.4748 57.2366 14.4778 123.7558 2.9789 23.5916 13.3161 150.6707 69.2821 258.2894 88.3341 535.0823 77.3823 56.0378 63.6156 21.3323 42.7921 21.6255 8.8317 2.8738 16.8736 21.5402 19.7909 12.1581 20.7959 19.6774
temp: 298.150 k
press: 1.00000 atm
elementType: 9 9 8 8 7 7 7 7 6 6 6 6 6 6 6 1 1 1 1 1 1 1 1 1 1 1 1 1 1
symmnumber: 1
zpe: 596102.8 jmol-1
zpe.correction: 0.227044 hartree
zpe.thermalcorrener: 0.244569 hartree
zpe.thermalcorrenthalpy: 0.245513 hartree
zpe.thermalcorrgfe: 0.179721 hartree
zpe.sumelectzpe: -843.087154 hartree
zpe.sumelectthermal: -843.069629 hartree
zpe.sumelectthermalent: -843.068684 hartree
zpe.sumelectthermalfe: -843.134477 hartree
dipole: 6.6595 -1.6625 -0.6007
dipole: 6.8901
quadrupole: -73.6431 -83.4306 -86.8660
quadrupole: 1.8739 -1.9492 7.3420
quadrupole: 7.6701 -2.1174 -5.5527 1.8739 -1.9492 7.3420
hfenergy: -843.3141974 hartree
pointgroup: C01 [X(C7H14F2N4O2)]
dipole: -2.6142693 0.6422621 -0.3184203 debye
polarizability: 140.9130897|13.1745709|105.9459847|-0.1118649|-10.2704326|94.0083284 unknown
InChI: InChI=1S/C7H14F2N4O2/c8-4(9)7(12,5(14)15)2-1-3-13-6(10)11/h4,14H,1-3,10-12H2
charge 0 multiplicity 1
29 atoms
F  1.885635 -2.17242 -0.689947
F  3.820494 -0.947917 -0.563399
O  1.328909 -0.794393 1.789576
O  2.610599 1.136369 1.800228
N  2.337258 1.485591 -0.981745
N  -2.61336 -0.120596 0.029379
N  -4.366457 -1.497986 0.76582
N  -4.931462 0.420792 -0.464862
C  1.727396 0.298225 -0.370952
C  0.21383 0.20714 -0.715698
C  -0.64767 1.353701 -0.145346
C  2.454437 -0.905724 -1.025873
C  -2.136369 1.163085 -0.516323
C  1.952085 0.2823 1.168773
C  -3.901988 -0.362847 0.083149
H  -0.19322 -0.74295 -0.334286
H  0.12593 0.195271 -1.821368
H  -0.565137 1.374669 0.958028
H  -0.319337 2.343139 -0.526083
H  2.47379 -0.80558 -2.124379
H  -2.224572 1.187394 -1.629166
H  -2.71483 2.035468 -0.126021
H  3.254085 1.720972 -0.586537
H  1.71433 2.296915 -1.002507
H  1.527729 -0.778222 2.765521
H  -3.636551 -2.050508 1.213634
H  -5.182326 -1.995257 0.411164
H  -5.87576 0.369349 -0.089455
H  -4.696069 1.206319 -1.063926
