program: Gaussian 09
title: 000121930
version: EM64L-G09RevD.01
frameworkgroup: C1[X(C19H22F3N3)]
method: RPBEPBE
basis: SDD
operation: Freq
keyword: #p
keyword: freq=noraman
keyword: PBEPBE/SDD
title: #p freq=noraman PBEPBE/SDD
converged: NO YES NO NO
title: Mulliken charges:
elementType: F F F N N N C C C C C C C C C C C C C C C C C C C H H H H H H H H H H H H H H H H H H H H H H
charge: -0.168340 -0.170246 -0.173305 -0.073387 -0.180011 -0.696711 -0.352665 -0.361870 -0.401369 -0.380798 -0.350399 -0.590509 0.506189 0.516369 -0.502303 -0.375915 0.311852 -0.216459 -0.403593 -0.406466 -0.393598 0.245642 -0.414417 -0.413715 0.480240 0.210022 0.186383 0.187500 0.214828 0.211689 0.218945 0.223576 0.206605 0.193967 0.224399 0.208023 0.221275 0.247496 0.236527 0.228617 0.224977 0.227841 0.262355 0.212586 0.212761 0.302626 0.302787
chargesum: 0.00000
title: Mulliken charges with hydrogens summed into heavy atoms:
elementType: F F F N N N C C C C C C C C C C C C C C C C C C C
charge: -0.168340 -0.170246 -0.173305 -0.073387 -0.180011 -0.091298 0.043740 0.040458 0.029265 0.049382 0.067967 -0.161210 0.506189 0.516369 -0.254807 -0.139388 0.311852 0.012158 -0.178616 -0.178625 -0.131243 0.245642 -0.201831 -0.200954 0.480240
polarizability: 3.60376252e+02 -2.83754540e+01 1.95210681e+02 5.30124664e+00 1.24534572e+01 1.59517676e+02
1716.lowfreq: -5.5342 -2.1792 -0.0007 0.0004 0.0008 5.7062 11.0935 12.2875 16.1225
frequency: 9.7039 12.1639 15.7306 19.2352 35.8218 50.0135 60.1375 88.4949 99.3535 120.9396 152.8174 163.7943 195.0998 223.7050 244.7993 268.0734 282.5362 300.0033 300.5026 313.7035 326.5582 342.4434 364.2532 369.1910 382.3569 395.9075 409.2004 410.3685 426.8389 448.3362 473.6245 486.5394 489.9177 514.1714 531.6437 562.2347 607.6098 620.0896 629.1164 639.2513 685.1785 686.9041 724.4891 752.4048 772.5412 784.9474 790.3437 799.7563 818.0216 824.1265 840.8407 843.4887 866.7470 879.0268 928.8538 936.3987 952.2828 954.4597 969.4068 974.7997 980.0944 998.4374 1000.5916 1003.1956 1010.7618 1033.5949 1044.0912 1053.6895 1059.8786 1070.8083 1090.7821 1108.9388 1127.1391 1136.1726 1150.8475 1173.7015 1187.5919 1192.8434 1206.7681 1217.0228 1222.7805 1241.2522 1268.6481 1270.8394 1289.8317 1296.6253 1306.9351 1312.3189 1316.3781 1320.1635 1343.5875 1351.5100 1366.1029 1373.0399 1379.2640 1384.9586 1391.6743 1397.2687 1433.0929 1452.1390 1453.3296 1458.6427 1463.6736 1468.5561 1472.0077 1484.6107 1494.4259 1519.8700 1581.3891 1583.3249 1624.7333 1633.0871 1644.9086 2842.4101 2849.2176 2863.7735 2921.5763 2934.8372 2988.1804 3018.7263 3036.7702 3048.6527 3053.9622 3063.6016 3092.6784 3103.8579 3106.2752 3127.0403 3134.1049 3139.9951 3171.5705 3176.2725 3182.6477 3568.9299 3709.3655
redmass: 5.9776 10.3588 4.0817 4.5646 3.6562 3.9256 4.2925 4.5333 5.7181 5.7679 5.3188 3.7885 3.0273 2.5283 2.9358 4.1667 2.5730 4.6980 4.3176 3.0725 1.2850 7.3828 1.0533 6.2972 2.6245 2.6501 2.7985 2.6778 4.6231 5.2851 3.0165 4.9091 4.6038 2.9100 6.5629 3.9135 11.2070 3.2632 3.5113 6.6176 4.6127 2.0677 3.3106 4.0862 4.9024 1.5391 1.2401 2.8496 1.2680 2.5468 2.2019 2.0877 1.6688 1.4024 3.1051 1.5487 1.4329 2.1441 1.5146 3.7668 11.4184 2.6307 2.7949 1.6441 6.8614 1.4977 2.4500 2.6239 2.5880 2.0725 2.1735 1.7870 1.4586 2.0368 2.5561 1.9862 1.0985 1.1105 1.1493 2.0783 2.0585 1.6451 1.4118 2.0271 1.3140 1.3373 1.4009 3.0851 1.3684 1.2545 1.3728 1.3878 1.4608 1.7381 1.7085 4.6971 3.8416 1.4520 3.2104 2.0571 1.0849 1.1685 1.1982 1.1929 1.1296 1.0967 2.7124 3.1077 6.6356 5.7843 6.1654 1.9931 1.9399 1.0716 1.0703 1.0695 1.0690 1.0707 1.0605 1.0877 1.0890 1.0915 1.0992 1.0904 1.0895 1.0868 1.0866 1.0961 1.0971 1.0877 1.0914 1.0904 1.0972 1.0448 1.1040
irintensity: 0.1376 0.2739 0.1025 0.4135 0.5124 0.9808 0.9741 1.6605 0.2227 0.5674 2.4895 1.4499 4.9593 4.7034 2.7287 4.8871 2.4504 3.9968 3.5590 13.1181 305.8012 0.6675 1.8292 4.0255 1.9539 0.7198 3.5783 1.4143 3.1122 0.7071 1.0771 7.6653 1.9244 19.9650 5.1535 8.4640 15.5018 5.0027 4.9648 0.2011 3.3073 25.7396 0.5053 3.4946 12.7396 61.2281 2.0910 30.1223 0.4261 40.7871 14.2983 9.0744 23.7790 10.2609 97.3725 23.9935 5.2830 25.2673 5.8810 42.9066 219.4020 31.2419 6.8241 6.7475 159.9098 1.7155 6.8092 17.6006 67.4179 9.5780 0.7179 4.0941 27.0785 89.5146 40.3828 8.2052 20.4226 0.3781 4.6257 0.9375 6.8687 98.9136 129.7491 194.9831 4.6205 55.7748 30.0712 81.6579 25.6431 0.6634 4.7832 2.7794 16.0744 25.8895 45.4547 10.4062 35.0857 0.3972 0.2398 123.0583 8.9758 25.3830 4.9163 10.7347 2.3615 10.8968 122.7824 149.3098 3.3132 30.6171 199.9793 0.0525 282.1957 47.0503 35.1978 153.4484 57.9157 76.2801 34.7506 12.3363 38.0516 42.3812 31.2036 25.9194 20.4207 7.1923 37.9523 50.0027 3.5631 14.6030 10.6704 6.2654 5.0759 74.0527 19.6220
temp: 298.150 k
press: 1.00000 atm
elementType: 9 9 9 7 7 7 6 6 6 6 6 6 6 6 6 6 6 6 6 6 6 6 6 6 6 1 1 1 1 1 1 1 1 1 1 1 1 1 1 1 1 1 1 1 1 1 1
symmnumber: 1
zpe: 991427.1 jmol-1
zpe.correction: 0.377615 hartree
zpe.thermalcorrener: 0.401141 hartree
zpe.thermalcorrenthalpy: 0.402085 hartree
zpe.thermalcorrgfe: 0.319390 hartree
zpe.sumelectzpe: -1199.152168 hartree
zpe.sumelectthermal: -1199.128642 hartree
zpe.sumelectthermalent: -1199.127698 hartree
zpe.sumelectthermalfe: -1199.210393 hartree
dipole: 7.3915 1.8364 0.3764
dipole: 7.6255
quadrupole: -143.6354 -141.4064 -147.5029
quadrupole: -26.7568 8.4129 4.5758
quadrupole: 0.5462 2.7752 -3.3213 -26.7568 8.4129 4.5758
hfenergy: -1199.5297831 hartree
pointgroup: C01 [X(C19H22F3N3)]
dipole: -2.8960361 0.59244 -0.5124492 debye
polarizability: 360.4942494|29.0148981|180.0167889|-1.5538764|-20.8235148|174.5935707 unknown
InChI: InChI=1S/C19H22F3N3/c20-19(21,22)16-2-1-3-18(14-16)25-12-10-24(11-13-25)9-8-15-4-6-17(23)7-5-15/h1-7,14H,8-13,23H2
charge 0 multiplicity 1
47 atoms
F  7.501617 -1.178406 -0.126649
F  6.577087 -1.167559 1.939537
F  5.706109 -2.494095 0.328761
N  -1.224546 0.269156 0.390727
N  1.644135 0.588564 0.065391
N  -9.006397 -1.272485 -0.294966
C  -0.669465 1.058294 -0.732243
C  -0.297274 -0.84571 0.696629
C  0.709302 1.643691 -0.373365
C  1.080038 -0.299766 1.106434
C  -2.611247 -0.206407 0.149514
C  -3.66605 0.928668 0.202538
C  3.035203 0.775601 -0.051119
C  -5.081165 0.383941 0.071261
C  3.950072 -0.264255 0.299083
C  3.596662 1.995798 -0.551153
C  5.338057 -0.089177 0.134789
C  4.98721 2.145371 -0.717645
C  -5.675654 0.169005 -1.199109
C  -5.84033 0.025825 1.214972
C  5.883464 1.110749 -0.377996
C  6.256527 -1.202991 0.548208
C  -6.96828 -0.376072 -1.330933
C  -7.134414 -0.520927 1.10553
C  -7.722309 -0.732985 -0.175334
H  -1.348864 1.896612 -0.965796
H  -0.567691 0.429736 -1.655493
H  -0.174179 -1.533714 -0.179519
H  -0.709776 -1.432529 1.537836
H  1.111143 2.132752 -1.276591
H  0.580472 2.418273 0.416878
H  0.971565 0.258783 2.063078
H  1.753176 -1.151376 1.286894
H  -2.700965 -0.747239 -0.827629
H  -2.85439 -0.939439 0.942232
H  -3.471195 1.659729 -0.605587
H  -3.53799 1.463637 1.162049
H  3.588035 -1.225095 0.671579
H  2.950363 2.842691 -0.794517
H  5.377922 3.093082 -1.103756
H  -5.119349 0.440952 -2.105876
H  -5.412831 0.183833 2.213811
H  6.962551 1.226804 -0.505825
H  -7.402118 -0.524509 -2.328005
H  -7.698156 -0.780896 2.010536
H  -9.426428 -1.41941 -1.207579
H  -9.54345 -1.525503 0.528718
