program: Gaussian 09
title: 000122664
version: EM64L-G09RevD.01
frameworkgroup: C1[X(C10H16N5O13P3)]
method: RPBEPBE
basis: SDD
operation: Freq
keyword: #p
keyword: freq=noraman
keyword: PBEPBE/SDD
title: #p freq=noraman PBEPBE/SDD
converged: NO YES NO NO
title: Mulliken charges:
elementType: P P P O O O O O O O O O O O O O N N N N N C C C C C C C C C C H H H H H H H H H H H H H H H H
charge: 1.408724 1.492928 1.442144 -0.262649 -0.497325 -0.484021 -0.779664 -0.655023 -0.602267 -0.200232 -0.802349 -0.797450 -0.526614 -0.807979 -0.695624 -0.568135 -0.154004 -0.459411 -0.355214 -0.042388 -0.616655 -0.150707 -0.085790 -0.087755 -0.401038 -0.301829 0.364068 -0.033548 0.026777 0.032828 0.152276 0.333284 0.246232 0.235916 0.239261 0.233125 0.245778 0.277598 0.361767 0.383425 0.388675 0.460025 0.359493 0.322614 0.484832 0.422612 0.453289
chargesum: 0.00000
title: Mulliken charges with hydrogens summed into heavy atoms:
elementType: P P P O O O O O O O O O O O O O N N N N N C C C C C C C C C C
charge: 1.408724 1.492928 1.442144 -0.262649 -0.497325 -0.100596 -0.779664 -0.194998 -0.602267 -0.200232 -0.802349 -0.312618 -0.526614 -0.385367 -0.695624 -0.568135 -0.154004 -0.070736 0.098075 -0.042388 0.065452 0.182578 0.160442 0.148161 0.071348 0.221547 0.364068 0.328218 0.026777 0.032828 0.152276
polarizability: 3.12719516e+02 -8.86498192e+00 2.91174208e+02 1.93846346e+01 1.60387201e+01 1.74774018e+02
1716.lowfreq: -2.5487 0.0013 0.0017 0.0017 3.4834 4.9342 19.9197 30.8409 44.2198
frequency: 19.9165 30.7589 44.2139 51.0363 53.8028 56.3321 66.8101 72.7621 81.3584 97.2009 106.2097 117.9477 141.6861 142.5987 152.7547 162.7298 177.5519 182.9384 197.2096 207.1813 213.0772 217.1398 231.3739 247.6854 257.3071 267.2838 273.7952 280.1492 293.7363 304.4164 319.7709 320.9002 325.6775 335.7528 338.0800 349.1559 360.2856 367.9879 377.7650 384.6776 388.1485 394.2862 410.7629 427.3002 439.6282 443.7522 476.5014 508.0021 541.1359 545.4556 553.6716 569.3920 588.4021 619.9287 623.1796 642.8830 649.7917 654.3671 685.1451 696.5251 698.2482 737.6797 751.6201 757.1477 764.4720 774.2695 790.9448 803.7504 822.9055 855.3671 862.9195 887.5726 902.6343 910.2933 936.6526 944.9710 950.4822 971.6305 999.6599 1014.9148 1020.0128 1042.3329 1050.6943 1058.1695 1067.9103 1094.7659 1095.8940 1112.9803 1120.6997 1159.4216 1166.1395 1171.2805 1197.1997 1212.8689 1224.3370 1242.7211 1247.7659 1251.0297 1273.0649 1297.1251 1316.8293 1319.3022 1333.0196 1354.1955 1367.9070 1372.0680 1380.0226 1400.1791 1402.0495 1431.0281 1441.5591 1471.2820 1483.4171 1510.2990 1543.6085 1591.3489 1608.6555 1642.6140 1652.7689 2397.3333 2507.5360 2974.2538 3001.3312 3012.2300 3019.0084 3043.7320 3046.8218 3084.6442 3096.8504 3147.2555 3269.9010 3543.9550 3584.7833 3656.7298 3695.9753
redmass: 8.8668 7.3168 12.4288 7.7312 11.8804 8.2230 10.7306 6.9724 9.1663 6.5584 7.9987 6.2664 5.0324 5.8201 5.1043 9.2218 6.0907 5.2708 6.4682 9.7717 4.8726 4.5018 7.5518 5.3845 5.5243 11.2692 7.6062 4.3158 4.9083 4.8118 4.4172 4.8785 8.2961 1.6857 3.9612 3.4548 5.0777 4.4453 7.5635 1.3587 7.1349 5.9592 5.4783 10.2962 4.3557 6.1829 7.7703 10.7709 7.9264 8.7225 1.1938 12.4648 5.5002 4.7091 6.0386 8.5222 5.7458 7.3444 5.4362 7.8689 7.9046 13.6217 3.6497 1.5346 10.4998 9.7250 3.8987 3.9764 2.7422 1.3287 1.7539 2.5733 5.0571 5.5093 4.8168 3.7120 1.4412 5.3431 2.0935 3.3405 2.9156 10.5665 2.7090 2.0963 1.2573 2.9552 6.2708 6.6637 2.1334 1.9248 1.5017 2.7310 1.4054 1.6249 1.1638 1.0965 1.2318 1.7704 1.3041 2.7610 1.5888 1.6623 1.6266 1.4598 1.3367 1.4696 2.2561 3.5911 1.7117 1.0743 1.0964 1.0906 3.5562 2.4367 2.3077 3.1620 1.3070 5.8671 4.5134 1.1348 1.0745 1.0850 1.0813 1.0607 1.0649 1.0833 1.0703 1.1062 1.1043 1.0873 1.1036 1.0453 1.0665 1.0665 1.1052
irintensity: 0.2808 4.0719 0.5035 2.8170 4.3773 2.9792 1.5865 6.7176 2.1914 1.8749 5.3200 0.7701 2.2796 4.6419 2.1994 7.7853 11.0407 5.3067 21.1186 4.4757 8.0163 45.0818 1.8228 14.6379 1.7314 33.5937 4.7646 26.7712 12.6907 19.6461 6.6991 27.8056 5.3342 58.8761 1.8993 14.8006 27.3310 10.7617 171.1308 245.0863 29.4810 31.2721 11.1548 34.4859 5.4205 22.9593 10.1701 143.4795 24.5979 2.6024 190.3130 75.2568 31.1123 7.7880 32.7567 9.6692 22.9221 12.1470 16.4549 90.9181 58.2656 363.8638 19.7541 10.6843 37.0262 333.8508 76.5084 176.4730 101.7540 47.0940 60.8734 97.1426 106.9256 154.1681 58.1662 24.9941 71.7815 114.7817 73.2972 71.3759 18.9089 140.6003 55.3409 17.4198 201.5424 67.0454 159.6822 431.5012 58.7275 14.0440 16.8883 7.8560 10.3996 9.0548 197.6980 84.9086 23.7098 20.7778 3.5684 46.7731 5.9482 49.0808 25.3480 39.7109 29.0966 75.1186 216.8302 66.7911 32.5794 29.8270 350.4325 10.0667 6.6945 270.9582 200.9707 81.0652 52.2473 251.6728 702.6799 2458.9954 1604.4822 32.8552 15.1500 49.1329 56.7940 136.9280 319.5948 10.6820 6.1939 706.5183 82.2934 124.0972 30.8101 83.6119 51.7009
temp: 298.150 k
press: 1.00000 atm
elementType: 15 15 15 8 8 8 8 8 8 8 8 8 8 8 8 8 7 7 7 7 7 6 6 6 6 6 6 6 6 6 6 1 1 1 1 1 1 1 1 1 1 1 1 1 1 1 1
symmnumber: 1
zpe: 819659.2 jmol-1
zpe.correction: 0.312192 hartree
zpe.thermalcorrener: 0.343887 hartree
zpe.thermalcorrenthalpy: 0.344831 hartree
zpe.thermalcorrgfe: 0.249725 hartree
zpe.sumelectzpe: -2663.647664 hartree
zpe.sumelectthermal: -2663.615969 hartree
zpe.sumelectthermalent: -2663.615025 hartree
zpe.sumelectthermalfe: -2663.710131 hartree
dipole: 14.4308 -10.4712 0.5130
dipole: 17.8370
quadrupole: -179.0954 -226.1321 -207.4811
quadrupole: -26.4110 -22.6460 11.7349
quadrupole: 25.1408 -21.8959 -3.2449 -26.4110 -22.6460 11.7349
hfenergy: -2663.9598557 hartree
pointgroup: C01 [X(C10H16N5O13P3)]
dipole: -0.805474 6.5026602 2.5126665 debye
polarizability: 269.5589377|7.3150557|297.8485988|-53.1175559|37.3390192|211.2602052 unknown
InChI: InChI=1S/C10H16N5O13P3/c11-10-13-7-6(8(17)14-10)12-3-15(7)9-4(1-16)5(26-9)2-25-30(21,22)28-31(23,24)27-29(18,19)20/h3-5,9,12-13,16,18,21,23H,1-2,11H2
charge 0 multiplicity 1
47 atoms
P  2.597335 0.094954 0.79642
P  3.043472 -1.904037 -1.559274
P  0.599662 -4.007535 -1.70938
O  0.594687 2.219765 -1.430319
O  3.106193 1.741319 0.812473
O  -1.316903 3.776646 2.237847
O  2.733735 -0.308626 -0.893443
O  3.885563 -0.694519 1.547853
O  1.148925 -0.086156 1.421711
O  -3.76595 -2.524297 1.40698
O  1.449108 -2.402374 -1.870954
O  3.424834 -2.712407 -0.083495
O  4.106134 -1.867827 -2.717093
O  1.722003 -4.507954 -0.373285
O  -0.806318 -3.565703 -1.090693
O  0.804254 -4.976483 -2.941748
N  -1.119129 0.962539 -0.251245
N  -2.86151 1.557455 1.43662
N  -1.503441 -1.223827 -0.33987
N  -4.223611 -0.331095 2.152204
N  -4.61655 1.817239 2.995203
C  0.356119 2.931033 0.628277
C  -0.536556 2.291126 -0.482429
C  1.424703 3.116392 -0.501666
C  -0.206037 4.167425 1.32599
C  2.869556 2.632819 -0.343328
C  -2.168055 0.682946 0.624438
C  -0.717111 -0.236058 -0.811409
C  -2.427953 -0.686883 0.566833
C  -3.499051 -1.294339 1.384663
C  -3.908994 0.957265 2.18116
H  0.679754 2.166851 1.35624
H  -1.34397 2.959435 -0.847185
H  1.431993 4.136468 -0.934461
H  0.578156 4.696425 1.89938
H  -0.659972 4.876744 0.612346
H  3.538791 3.483652 -0.135414
H  3.18091 2.135942 -1.281914
H  0.116786 -0.356227 -1.495892
H  -0.943922 3.502827 3.11287
H  -2.454868 2.485573 1.689271
H  3.955577 -1.646901 1.177321
H  -5.356822 1.400226 3.555696
H  -4.545475 2.829305 2.920126
H  2.830477 -3.586309 -0.009434
H  1.672963 -5.460878 -0.123225
H  -1.316691 -2.271935 -0.610466
