program: Gaussian 09
title: 000122033
version: EM64L-G09RevD.01
frameworkgroup: C1[X(C21H23F3N6O)]
method: RPBEPBE
basis: SDD
operation: Freq
keyword: #p
keyword: freq=noraman
keyword: PBEPBE/SDD
title: #p freq=noraman PBEPBE/SDD
converged: YES YES NO NO
title: Mulliken charges:
elementType: F F F O N N N N N N C C C C C C C C C C C C C C C C C C C C C H H H H H H H H H H H H H H H H H H H H H H H
charge: -0.118731 -0.163910 -0.149870 -0.264281 -0.273861 -0.355970 -0.315196 -0.005554 -0.108471 -0.089147 -0.085088 -0.366408 -0.422211 -0.363821 -0.462991 0.599541 -0.500108 -0.476892 -0.396141 0.318837 -0.235119 -0.261296 0.162736 -0.492967 -0.250747 0.498752 -0.341934 -0.393632 0.142749 -0.534888 0.364994 0.216032 0.203905 0.216603 0.185276 0.193398 0.193472 0.222175 0.201944 0.270474 0.252505 0.236290 0.236593 0.232535 0.220606 0.240044 0.227371 0.328893 0.249658 0.248705 0.263700 0.226569 0.226326 0.248554
chargesum: 0.00000
title: Mulliken charges with hydrogens summed into heavy atoms:
elementType: F F F O N N N N N N C C C C C C C C C C C C C C C C C C C C C
charge: -0.118731 -0.163910 -0.149870 -0.264281 -0.003387 -0.103466 -0.315196 -0.005554 -0.108471 -0.089147 0.130945 -0.162503 -0.020332 0.023050 -0.038872 0.599541 -0.027225 -0.244357 -0.175536 0.318837 0.004925 -0.033925 0.162736 -0.164074 -0.001089 0.498752 -0.093229 -0.129931 0.142749 0.166560 0.364994
polarizability: 3.09619316e+02 4.19034469e+01 2.88971070e+02 4.51941468e+00 -2.81348577e+01 2.01662451e+02
1716.lowfreq: -4.5002 -3.7031 -2.1515 0.0005 0.0006 0.0009 10.2891 20.0840 28.0423
frequency: 7.5907 19.5077 27.9339 36.0105 44.5103 46.4928 53.8629 59.1895 81.2098 98.0746 110.5131 121.2033 133.2082 140.3703 146.9660 158.0173 186.3615 218.7153 225.6399 230.8738 239.0400 252.7209 264.9359 283.3481 301.5301 323.5002 329.8695 342.5372 366.7470 378.2674 402.8812 411.5276 424.1329 433.5285 445.0446 449.2084 472.8547 503.6917 506.8851 512.4538 529.0407 548.0209 556.5742 567.5424 593.7123 612.5102 617.1055 623.3744 630.4195 657.2467 669.6500 708.7875 716.3448 730.5717 755.9152 770.9794 801.2439 806.1162 829.2043 854.3342 856.3252 860.2317 891.2573 904.2363 913.2731 918.7515 930.2914 933.6742 941.8274 968.3182 971.4105 972.6538 976.9530 983.6107 985.7373 990.4117 1002.2977 1014.3137 1028.4329 1043.5577 1045.4019 1048.5852 1070.5643 1076.5342 1093.8934 1104.5054 1113.5015 1118.9237 1135.5015 1146.9950 1149.4957 1159.3811 1160.4087 1175.1198 1184.9461 1189.8358 1201.5374 1207.6510 1216.0798 1242.6181 1246.3303 1250.6914 1266.0012 1295.7003 1299.9034 1313.5492 1316.0431 1333.8767 1336.8589 1341.6117 1348.8879 1352.0546 1366.2720 1384.0130 1389.8290 1432.2297 1436.3489 1438.5967 1443.5511 1447.7346 1451.6979 1457.3726 1461.4333 1462.7989 1466.2619 1468.9114 1472.8838 1484.8885 1487.0227 1590.0653 1591.7311 1613.3491 1615.3563 2934.6506 2947.4476 2953.8834 2962.4745 2965.7200 2968.3358 2987.5990 3001.8708 3018.5554 3029.9226 3049.2873 3060.0453 3103.3342 3122.8031 3130.5358 3132.3201 3146.6540 3157.8579 3158.6312 3164.2300 3177.3108 3462.3688 3493.9089
redmass: 4.2701 5.4105 9.2979 12.3956 5.3023 5.1528 6.8423 5.3497 4.0210 4.7209 4.6546 3.1297 5.7335 4.9865 5.6945 5.1765 2.9150 2.2112 2.1380 3.4634 2.8649 3.1783 5.7739 3.1559 3.5054 3.0492 3.3493 8.5963 2.5111 7.2302 2.8221 8.3528 3.3654 4.1783 5.1849 3.3967 3.3019 3.9730 2.3842 8.4154 2.7423 3.0698 2.8040 2.1350 4.1126 4.5593 6.1418 4.0930 5.6032 15.6606 12.4773 1.8654 9.2866 4.1117 5.5409 1.7773 2.9598 1.4653 1.9821 1.2503 5.8022 1.8640 2.0393 12.2850 2.9998 1.9321 1.8679 1.5777 2.3950 2.1398 1.9460 3.6759 1.8270 8.2667 7.1188 6.2066 1.3235 6.1465 2.1949 1.8837 3.9658 3.2656 3.1170 1.9682 3.1301 3.8745 1.2665 1.9790 4.3754 3.2500 1.7049 1.9265 1.7370 1.0580 1.7694 1.1299 1.4807 1.6551 2.1483 1.6121 1.8508 1.5844 3.0061 1.2819 1.3461 1.3486 1.3401 1.3775 1.4758 1.4095 1.3122 1.2501 5.9831 6.0592 5.5122 2.3963 1.2312 1.6229 1.4307 1.4889 1.1085 1.2189 1.1115 1.1102 1.7466 1.0719 1.8318 2.3396 2.3704 7.8906 5.9847 6.2217 6.6372 1.0825 1.0627 1.0599 1.0670 1.0605 1.0326 1.0852 1.0995 1.0976 1.1008 1.0997 1.1043 1.0878 1.0873 1.1001 1.0901 1.0952 1.0914 1.0887 1.1009 1.0966 1.0752 1.0753
irintensity: 0.1035 0.2762 0.2611 0.0611 0.3407 0.0498 0.5760 0.4338 1.1777 0.6025 4.1895 0.2648 0.7906 7.3660 2.7944 2.7925 5.4403 1.8328 2.5302 2.8213 1.1165 2.2387 0.0769 8.0037 4.7469 4.9847 5.9089 0.9299 4.0876 0.6495 0.0351 0.9191 3.9435 12.5207 9.9800 7.7833 27.1915 10.7705 34.5700 11.6763 7.4943 17.8120 55.7291 62.8624 5.3363 24.8190 0.8219 0.7701 0.2677 6.2983 3.2993 55.5681 2.6085 3.7330 2.4177 86.4578 4.0087 50.1971 18.1406 2.2662 3.5199 3.7615 5.6079 4.1894 28.5376 7.0001 4.2970 10.8315 12.3779 13.7323 16.3717 158.0675 37.4356 45.4992 67.1175 0.7654 3.3465 57.7097 4.8117 4.0698 86.1761 76.1316 111.1544 10.9445 2.4362 50.3278 0.5895 20.2789 11.6058 94.2510 27.0261 7.9551 39.7618 0.4128 30.3675 0.7469 15.7618 0.7370 73.4956 68.0873 87.8222 1.2553 21.4315 1.9516 0.2786 4.9750 2.8190 1.5672 20.3596 2.0968 4.0563 1.0967 10.2875 0.1159 12.2842 9.8281 30.4239 6.8187 18.1777 42.0112 2.8991 45.2421 18.0887 12.2068 56.6198 20.5644 60.9628 10.3350 57.5338 0.1079 1.2990 6.0607 62.7145 18.8702 28.1966 34.2458 63.1720 38.6825 69.3796 17.3263 21.2769 45.9523 96.3214 49.6770 39.0296 14.7704 7.1592 19.3026 5.0577 24.6571 9.5360 10.7236 12.1370 6.2354 0.3257 1.6314
temp: 298.150 k
press: 1.00000 atm
elementType: 9 9 9 8 7 7 7 7 7 7 6 6 6 6 6 6 6 6 6 6 6 6 6 6 6 6 6 6 6 6 6 1 1 1 1 1 1 1 1 1 1 1 1 1 1 1 1 1 1 1 1 1 1 1
symmnumber: 1
zpe: 1095135.1 jmol-1
zpe.correction: 0.417115 hartree
zpe.thermalcorrener: 0.445402 hartree
zpe.thermalcorrenthalpy: 0.446346 hartree
zpe.thermalcorrgfe: 0.355114 hartree
zpe.sumelectzpe: -1514.928867 hartree
zpe.sumelectthermal: -1514.900581 hartree
zpe.sumelectthermalent: -1514.899636 hartree
zpe.sumelectthermalfe: -1514.990868 hartree
dipole: 4.5546 7.7950 -1.8769
dipole: 9.2211
quadrupole: -184.5897 -167.9908 -182.7182
quadrupole: -9.4857 4.2939 0.5891
quadrupole: -6.1568 10.4421 -4.2853 -9.4857 4.2939 0.5891
hfenergy: -1515.3459822 hartree
pointgroup: C01 [X(C21H23F3N6O1)]
dipole: -0.7058843 3.5463419 0.2942768 debye
polarizability: 285.6224228|-36.313262|320.9870411|8.9830991|11.4592673|193.643373 unknown
InChI: InChI=1S/C21H23F3N6O/c1-31-18-10-9-16(30-20(21(22,23)24)27-28-29-30)12-15(18)13-26-17-8-5-11-25-19(17)14-6-3-2-4-7-14/h2-4,6-7,9-10,12,17,19,25-26H,5,8,11,13H2,1H3
charge 0 multiplicity 1
54 atoms
F  3.687197 -2.925544 1.624038
F  4.492685 -1.025327 0.689109
F  2.503333 -0.999807 1.785181
O  0.476105 4.193892 -0.767748
N  -4.93837 -0.594272 1.233968
N  -2.561923 1.257676 -1.13236
N  1.868903 -1.254835 -1.140242
N  1.344896 -2.000821 -2.219062
N  2.570271 -3.368315 -0.888554
N  1.77767 -3.26687 -2.042224
C  -3.439343 1.095009 0.046952
C  -3.937269 -0.391679 0.152468
C  -4.656227 2.065772 0.027139
C  -5.601686 1.848378 1.230866
C  -6.060371 0.367289 1.250645
C  -2.788208 -1.379406 0.336646
C  -1.593958 2.36387 -1.135028
C  -2.57322 -2.427954 -0.589682
C  -1.925528 -1.283662 1.460004
C  -0.135926 1.903578 -1.024321
C  -1.524528 -3.357792 -0.407136
C  -0.881428 -2.215167 1.654468
C  0.905733 2.861064 -0.83752
C  0.208193 0.546853 -1.111639
C  -0.676709 -3.257844 0.72034
C  1.560323 0.146533 -1.013827
C  2.259325 2.45708 -0.736797
C  2.591339 1.090165 -0.8311
C  2.600884 -2.119034 -0.354996
C  1.490502 5.232964 -0.557508
C  3.306481 -1.782227 0.91738
H  -2.826412 1.313046 0.945061
H  -4.447912 -0.620073 -0.80975
H  -4.291196 3.111056 -0.011338
H  -5.222729 1.889836 -0.913532
H  -6.477751 2.523914 1.164062
H  -5.072969 2.087036 2.176574
H  -6.685718 0.154011 2.136791
H  -6.689146 0.178627 0.355572
H  -4.494722 -0.723942 2.151843
H  -3.059628 1.134708 -2.019633
H  -1.688902 2.974672 -2.056374
H  -1.797059 3.073154 -0.306495
H  -3.234037 -2.518545 -1.460092
H  -2.057712 -0.47202 2.187773
H  -1.364475 -4.154849 -1.141141
H  -0.226659 -2.12618 2.528819
H  -0.600444 -0.179708 -1.237342
H  0.126989 -3.987778 0.869869
H  3.059452 3.188862 -0.597647
H  3.638336 0.777659 -0.777636
H  2.025465 5.081686 0.399406
H  2.215823 5.25733 -1.392978
H  0.929656 6.17813 -0.525074
