program: Gaussian 09
title: 000121923
version: EM64L-G09RevD.01
frameworkgroup: C1[X(C18H21NO8)]
method: RPBEPBE
basis: SDD
operation: Freq
keyword: #p
keyword: freq=noraman
keyword: PBEPBE/SDD
title: #p freq=noraman PBEPBE/SDD
converged: YES YES NO NO
title: Mulliken charges:
elementType: O O O O O O O O N C C C C C C C C C C C C C C C C C C H H H H H H H H H H H H H H H H H H H H H
charge: -0.259071 -0.293406 -0.473014 -0.458379 -0.431068 -0.324349 -0.248152 -0.191353 -0.418958 -0.081403 -0.181608 -0.089290 -0.043729 -0.070971 -0.380141 0.295152 0.403591 -0.479256 -0.442769 -0.767043 0.201801 0.234169 -0.359419 0.406325 -0.478843 -0.809124 0.127880 0.286047 0.213173 0.220431 0.240410 0.213656 0.194376 0.255889 0.333857 0.382417 0.371355 0.353869 0.312667 0.258023 0.261313 0.263479 0.219022 0.250169 0.256228 0.243868 0.239833 0.242343
chargesum: 0.00000
title: Mulliken charges with hydrogens summed into heavy atoms:
elementType: O O O O O O O O N C C C C C C C C C C C C C C C C C C
charge: -0.259071 -0.293406 -0.090597 -0.087023 -0.077199 -0.324349 -0.248152 -0.191353 -0.085101 0.204645 0.031565 0.131141 0.196681 0.142685 0.070124 0.295152 0.403591 -0.166589 -0.184746 -0.023229 0.201801 0.234169 -0.109250 0.406325 -0.222614 -0.083080 0.127880
polarizability: 3.31064995e+02 -1.12767138e+01 2.38885458e+02 -1.32702148e+01 3.24459792e+01 1.61620456e+02
1716.lowfreq: -7.5288 -2.0871 -0.0006 0.0004 0.0005 3.8100 19.1291 22.4727 31.9246
frequency: 18.8293 22.3517 31.9127 41.5370 57.8077 73.1750 81.4295 86.8881 93.9148 97.3754 126.7473 138.0963 147.4971 168.3039 180.6051 185.1461 207.6897 216.6571 249.6858 255.8152 278.6000 287.2596 292.4546 301.8657 315.6621 335.2818 366.0600 401.8078 407.0053 419.1669 436.6428 446.6193 453.2704 458.6627 490.3116 509.6386 517.7535 542.8416 546.4966 555.7253 574.9007 587.6931 596.4497 608.9151 622.5806 666.4963 668.9850 682.5393 702.5786 708.6680 744.5420 766.4917 785.6873 819.7957 838.7751 869.0767 874.6857 876.0764 896.2252 947.5305 955.2936 959.9367 977.1818 982.5832 994.8729 1002.0735 1005.8432 1025.4688 1028.4544 1045.8441 1047.0807 1052.3360 1055.1183 1063.9832 1074.4684 1090.5100 1112.5109 1115.7819 1122.9578 1136.4513 1167.0546 1181.9371 1194.9037 1228.5051 1230.4239 1244.2078 1250.7747 1269.3189 1274.5723 1285.2359 1291.1628 1304.7305 1325.2668 1332.2491 1345.3596 1350.9976 1364.1665 1378.7459 1381.5591 1388.8588 1393.4392 1401.0466 1402.1387 1427.2012 1435.9642 1449.1159 1460.0550 1467.5719 1469.6185 1470.2121 1494.6314 1502.4046 1557.7973 1611.4243 1612.7311 1618.3967 1693.7377 2912.6496 2931.9930 2960.2526 2967.6757 2981.8647 2988.2104 3002.1787 3002.8791 3057.4226 3058.6958 3102.1486 3104.1482 3108.8679 3111.6999 3153.3768 3172.7974 3177.0540 3188.0132 3501.3891 3504.9704 3551.2572
redmass: 7.2466 4.9864 6.4543 5.9439 4.7165 1.7479 3.3770 2.5873 4.7333 7.0861 7.2000 4.5818 3.9275 1.6773 3.2040 4.2861 1.7417 4.8620 6.5028 6.6566 4.3951 5.0479 4.7332 4.2981 4.2092 5.7184 4.6218 4.0020 1.7886 6.4903 2.6655 5.8419 3.4444 3.2525 4.6135 5.8880 1.1882 4.3765 4.3044 3.8141 4.1821 3.5656 3.6265 4.3910 4.0949 6.6421 3.8409 1.6267 2.2393 4.7343 3.6284 7.1650 6.5846 1.4883 2.9488 1.5519 1.1503 1.3846 3.7830 4.9486 1.3373 4.9845 2.9437 4.6268 1.8388 2.3934 4.0263 4.2385 3.1969 1.5817 1.6620 4.1188 3.7809 2.6590 3.7046 3.1591 2.2444 2.9048 3.7205 1.8803 2.0072 1.2968 1.3301 2.2031 1.4554 1.1275 1.8045 1.2351 1.4042 1.3519 1.5524 1.3214 1.2090 1.3300 1.2950 1.2169 1.2805 1.4383 1.9886 4.3243 1.2227 1.4344 1.8654 5.1413 1.3864 1.0472 1.0815 1.0466 1.0954 1.1020 2.4264 2.6680 7.2260 7.3977 4.4977 6.9623 10.5704 1.0822 1.0818 1.0828 1.0721 1.0383 1.0821 1.0555 1.0638 1.0683 1.0969 1.0982 1.0984 1.1007 1.0945 1.0880 1.0921 1.0967 1.0926 1.0764 1.0648 1.0658
irintensity: 0.5758 1.0348 0.4267 0.6616 5.3577 1.7806 4.4599 1.9525 0.6385 0.3617 3.0547 6.1727 1.6500 0.0041 0.8849 5.6703 1.7109 11.5404 6.8774 2.3467 1.9086 1.5115 6.6605 8.2202 1.7096 3.0139 4.7496 21.2807 78.6117 4.6924 92.1544 2.6160 2.6980 24.6210 29.0366 7.8734 171.1674 11.3047 10.2197 11.3768 0.9142 9.6419 24.1608 11.3302 1.5484 2.1642 3.0543 62.7970 40.9903 2.4002 3.0454 25.8486 41.2844 28.9923 28.2317 20.3432 168.9559 39.9817 37.3527 41.9050 0.2600 50.0331 115.9108 217.6942 29.3416 49.7560 53.2695 32.2297 136.7788 7.8514 20.5843 105.4707 4.0957 112.0284 10.4542 84.4517 5.4313 73.5653 2.1097 71.0146 98.4570 70.2668 7.6731 63.6084 11.7063 26.1041 121.5421 5.0190 70.6091 10.3246 59.0968 8.8629 6.1248 33.9388 107.8642 12.4165 9.0763 5.9373 110.8909 8.1012 57.7121 74.6079 6.6258 21.1034 233.0216 16.9987 8.2415 17.0304 46.8454 8.4022 254.4122 85.9077 15.0049 41.8546 149.7019 347.1747 501.6997 23.5738 30.0305 21.0804 15.4841 11.5481 75.6058 18.4601 23.4140 625.1656 16.3399 7.1559 20.6607 17.4471 7.4272 5.2279 1.5099 4.8060 1.4669 70.6182 30.0179 9.2236
temp: 298.150 k
press: 1.00000 atm
elementType: 8 8 8 8 8 8 8 8 7 6 6 6 6 6 6 6 6 6 6 6 6 6 6 6 6 6 6 1 1 1 1 1 1 1 1 1 1 1 1 1 1 1 1 1 1 1 1 1
symmnumber: 1
zpe: 976924.9 jmol-1
zpe.correction: 0.372091 hartree
zpe.thermalcorrener: 0.398006 hartree
zpe.thermalcorrenthalpy: 0.398950 hartree
zpe.thermalcorrgfe: 0.314566 hartree
zpe.sumelectzpe: -1353.039120 hartree
zpe.sumelectthermal: -1353.013205 hartree
zpe.sumelectthermalent: -1353.012261 hartree
zpe.sumelectthermalfe: -1353.096644 hartree
dipole: -2.1501 -9.7246 -3.0832
dipole: 10.4258
quadrupole: -171.6941 -164.2771 -162.3397
quadrupole: 19.9463 15.5541 -6.0906
quadrupole: -5.5904 1.8265 3.7640 19.9463 15.5541 -6.0906
hfenergy: -1353.4112107 hartree
pointgroup: C01 [X(C18H21N1O8)]
dipole: -0.9752451 3.8969148 0.8294094 debye
polarizability: 329.1354377|13.3919119|244.6429701|18.8930237|26.0009794|157.7925017 unknown
InChI: InChI=1S/C18H21NO8/c1-8-5-14(22)26-12-6-10(3-4-11(8)12)25-18-15(19-9(2)21)17(24)16(23)13(7-20)27-18/h3-6,13,15-20,23-24H,7H2,1-2H3
charge 0 multiplicity 1
48 atoms
O  1.374052 -1.189765 0.772084
O  0.583994 1.021601 0.622958
O  5.342304 -0.064282 0.008725
O  4.61712 -2.730557 -0.208991
O  0.580904 -3.931542 0.782367
O  5.154808 2.26448 -1.102581
O  -3.24686 -1.285523 -1.30111
O  -5.027462 -2.399738 -2.261503
N  2.921259 1.990457 -0.428418
C  2.93333 0.664898 0.242651
C  3.958347 -0.370268 -0.301458
C  3.725481 -1.739086 0.379955
C  2.284588 -2.236844 0.207004
C  1.515399 0.06427 0.057057
C  1.968749 -3.51499 0.983451
C  3.957795 2.699117 -0.992672
C  -0.797066 0.869718 0.367439
C  -1.353739 -0.202448 -0.354805
C  -1.61311 1.906022 0.89446
C  3.602622 4.08688 -1.510014
C  -2.74914 -0.20918 -0.567499
C  -3.605157 0.814543 -0.06002
C  -2.996195 1.869076 0.680532
C  -5.039259 0.718527 -0.319202
C  -5.520009 -0.351941 -1.050081
C  -5.978889 1.77968 0.208677
C  -4.678128 -1.412389 -1.59072
H  3.110985 0.793128 1.329848
H  3.806875 -0.481296 -1.400373
H  3.943335 -1.606295 1.462762
H  2.047964 -2.381935 -0.868655
H  1.296691 -0.086417 -1.027362
H  2.195002 -3.357183 2.059324
H  2.594628 -4.334097 0.598815
H  2.026955 2.479914 -0.321352
H  5.547942 0.829379 -0.436658
H  5.514831 -2.301844 -0.241604
H  -0.006527 -3.196607 1.096148
H  -0.762053 -1.038855 -0.73234
H  -1.14319 2.71222 1.464172
H  4.196677 4.836602 -0.959526
H  3.894703 4.15721 -2.571253
H  2.532493 4.336212 -1.415026
H  -3.620265 2.66888 1.090686
H  -6.587029 -0.456567 -1.264806
H  -7.021139 1.563601 -0.074954
H  -5.716352 2.778995 -0.186676
H  -5.930463 1.84234 1.312143
