program: Gaussian 09
title: 000122461
version: EM64L-G09RevD.01
frameworkgroup: C1[X(C23H23N3O8S)]
method: RPBEPBE
basis: SDD
operation: Freq
keyword: #p
keyword: freq=noraman
keyword: PBEPBE/SDD
title: #p freq=noraman PBEPBE/SDD
converged: YES YES NO NO
title: Mulliken charges:
elementType: S O O O O O O O O N N N C C C C C C C C C C C C C C C C C C C C C C C H H H H H H H H H H H H H H H H H H H H H H H
charge: 0.629066 -0.581342 -0.162778 -0.235952 -0.235536 -0.252149 -0.331200 -0.200362 -0.201328 -0.143634 -0.360863 0.027928 -0.382494 -0.032612 -0.170100 -0.179692 0.111376 -0.724136 -0.726662 0.286100 0.171496 -0.400419 -0.485738 0.474917 -0.334618 -0.353097 0.413179 -0.356518 -0.353707 0.377399 -0.338297 -0.380404 -0.226237 -0.194358 -0.249927 0.341854 0.292345 0.296874 0.247972 0.255389 0.229153 0.306339 0.239732 0.239212 0.359318 0.251299 0.251082 0.238097 0.252986 0.281675 0.249340 0.290732 0.290264 0.252966 0.241942 0.230004 0.230918 0.233207
chargesum: 0.00000
title: Mulliken charges with hydrogens summed into heavy atoms:
elementType: S O O O O O O O O N N N C C C C C C C C C C C C C C C C C C C C C C C
charge: 0.629066 -0.581342 -0.162778 -0.235952 -0.235536 -0.252149 -0.331200 -0.200362 -0.201328 -0.143634 -0.001545 0.027928 -0.040641 -0.032612 0.122245 0.117182 0.111376 0.008378 0.058621 0.286100 0.171496 0.101961 0.005345 0.474917 -0.052944 -0.103757 0.413179 -0.065786 -0.063443 0.377399 -0.085332 -0.138462 0.003767 0.036561 -0.016721
polarizability: 4.02779461e+02 -9.90829880e+00 3.20944845e+02 -7.38645847e+00 -7.91029878e+00 2.55151870e+02
1716.lowfreq: -4.0120 -2.2530 0.0005 0.0007 0.0009 1.6492 5.5001 11.7539 15.6310
frequency: 5.2736 11.6842 15.5564 19.3071 24.9013 30.8705 37.6910 49.2630 55.2118 59.5193 62.8102 69.0281 72.6395 91.4711 122.1521 128.3784 141.3133 149.4284 157.3557 176.1035 177.4322 197.5309 207.9076 217.4102 227.0609 231.3201 249.0364 254.4905 259.6917 279.1778 281.7447 291.3074 310.1736 330.1446 341.5289 356.9228 377.2868 390.0625 407.2620 409.5506 410.4900 423.1915 451.7279 473.0570 483.7772 499.6861 505.9864 512.3578 527.2169 566.0454 584.4512 610.4669 614.6438 627.5238 630.7681 648.2024 673.2410 691.4839 695.5359 706.4935 716.3445 720.5382 733.0464 752.3453 759.1707 768.1668 780.4164 805.9821 821.6441 824.0429 825.8094 827.4404 856.7323 860.6420 883.1013 893.4334 912.9557 935.7471 948.0110 961.9041 963.3782 979.4190 982.5625 986.1311 986.6734 989.0312 990.2553 1002.3526 1003.0342 1007.0043 1007.9465 1008.6351 1023.9054 1074.2097 1085.4518 1090.9122 1105.0939 1115.8509 1117.2479 1146.6506 1169.5091 1178.7950 1180.9562 1181.5081 1183.1619 1202.4617 1204.8788 1212.0212 1216.0676 1219.9107 1222.4068 1223.8541 1232.2105 1246.0227 1290.4709 1297.1282 1305.2459 1316.1279 1331.5648 1341.0802 1344.6496 1350.3103 1370.8732 1389.6343 1392.6547 1400.7639 1408.5828 1422.4260 1444.0042 1453.6666 1457.0051 1463.6127 1464.4849 1473.3199 1479.0799 1480.7497 1482.2690 1494.0487 1596.2419 1599.2979 1610.1955 1611.7024 1619.6891 1630.1045 1733.8571 2912.0065 2975.9481 2981.3063 3009.8797 3030.3922 3035.2471 3044.0983 3045.2003 3066.6180 3066.8222 3088.5592 3091.9974 3123.7306 3133.4778 3141.1921 3142.8170 3157.4283 3159.0789 3164.7022 3175.2758 3184.1549 3186.5483 3508.2566
redmass: 8.1439 6.4228 7.4951 6.8999 4.0849 6.4585 5.5276 8.0823 7.1408 7.1974 6.6508 6.2380 8.3460 9.9020 8.6600 3.6894 5.7402 2.2051 2.1160 5.3409 3.9847 4.5010 7.5492 5.6944 4.8398 4.3786 5.4263 1.6830 3.2793 2.8592 5.7710 4.2665 6.9752 4.7223 6.7455 3.1874 4.5744 5.8099 4.2614 3.0879 2.9115 5.7660 3.4857 3.3202 6.1443 2.9166 6.7893 4.2350 5.1965 7.3239 3.5710 6.4403 6.0517 6.7510 5.7394 5.5699 4.4722 2.0951 3.2249 2.9573 1.7912 5.2167 5.6879 6.6835 1.5910 7.2747 4.7761 6.7858 4.8307 1.2529 6.3704 8.0745 1.4038 3.5997 1.8214 1.4324 5.4423 5.0727 2.1324 1.6266 1.3680 5.6574 1.9647 5.2215 1.3197 2.4807 1.3554 5.3284 1.3876 1.8192 2.9639 1.4431 2.0824 2.9049 1.5260 3.3295 1.6532 1.2942 1.6611 1.6737 1.0936 3.5813 1.2995 1.3298 1.3455 1.8141 1.3017 3.1472 2.9142 2.6449 5.4419 2.2920 1.2054 1.9671 3.3611 1.9300 1.2859 1.3257 1.3917 1.3574 1.5500 1.3073 7.7173 7.1681 1.2033 7.0366 1.1680 3.5493 2.0565 1.2149 1.0448 1.0579 1.1395 1.0649 1.9887 1.0777 2.2046 2.1468 6.4239 7.7088 6.2538 6.3628 9.4233 8.0495 12.7131 1.0516 1.0369 1.0556 1.0837 1.0838 1.0802 1.1059 1.0593 1.0978 1.0915 1.1002 1.1000 1.1075 1.0849 1.0888 1.0910 1.0923 1.0908 1.0958 1.1012 1.0947 1.0960 1.0778
irintensity: 0.4497 0.3670 0.5053 0.2488 0.2933 0.5725 0.4843 0.8143 0.2649 1.0847 2.9110 0.6263 3.4875 0.9011 6.8070 3.9639 4.8097 5.2912 6.4189 7.7385 0.8798 10.7086 0.6537 3.0013 9.0093 3.1682 0.7309 0.8871 0.3394 1.6301 3.2415 2.7324 0.7511 1.8304 9.2837 0.6782 15.1779 13.0194 4.0169 0.5064 0.0269 16.3341 0.4753 0.4670 12.4870 11.2643 0.7333 20.5728 24.1278 1.3633 1.0927 0.3560 6.7100 0.4005 6.6848 6.4715 30.5945 15.5362 6.7144 30.8871 54.7606 6.3687 9.2995 1.3060 95.6360 60.6343 9.1842 33.4325 16.0595 0.1016 29.7537 32.8627 7.7770 11.9778 98.6360 7.4183 121.3397 13.8866 14.0039 0.7481 0.0140 24.4508 13.4415 1.9374 0.4475 21.7435 2.2213 28.9875 0.6085 0.4740 4.6250 0.2396 29.4632 112.3511 17.7759 14.5799 40.4964 10.3606 28.7216 38.8473 15.9675 288.2431 39.4464 50.5939 47.0134 22.8412 10.0670 283.4163 141.5473 22.2575 87.9317 21.4147 5.5317 39.7926 122.8069 12.9157 1.2351 1.0978 13.9482 4.8430 25.0268 16.7412 92.9611 7.9120 29.5077 4.7103 40.5134 47.0433 13.7899 121.7407 7.7741 2.1582 22.7251 14.1442 187.4781 18.2243 7.7108 349.8051 26.4331 4.2438 16.4464 80.2084 150.6541 223.3472 473.8796 11.4258 13.4989 19.7293 4.6526 38.4199 5.1725 11.0379 22.7820 11.7352 2.7408 8.8550 15.6147 3.0292 3.0799 7.5844 6.9808 27.5611 0.2473 19.8829 6.2106 0.4264 3.6236 89.5435
temp: 298.150 k
press: 1.00000 atm
elementType: 16 8 8 8 8 8 8 8 8 7 7 7 6 6 6 6 6 6 6 6 6 6 6 6 6 6 6 6 6 6 6 6 6 6 6 1 1 1 1 1 1 1 1 1 1 1 1 1 1 1 1 1 1 1 1 1 1 1
symmnumber: 1
zpe: 1131786.4 jmol-1
zpe.correction: 0.431075 hartree
zpe.thermalcorrener: 0.464817 hartree
zpe.thermalcorrenthalpy: 0.465762 hartree
zpe.thermalcorrgfe: 0.358366 hartree
zpe.sumelectzpe: -2051.638125 hartree
zpe.sumelectthermal: -2051.604382 hartree
zpe.sumelectthermalent: -2051.603438 hartree
zpe.sumelectthermalfe: -2051.710833 hartree
dipole: -2.7007 2.9808 3.7848
dipole: 5.5230
quadrupole: -228.4445 -212.3415 -240.0168
quadrupole: -39.0353 23.2194 7.3964
quadrupole: -1.5103 14.5928 -13.0825 -39.0353 23.2194 7.3964
hfenergy: -2052.0691994 hartree
pointgroup: C01 [X(C23H23N3O8S1)]
dipole: 1.3983771 0.2326639 -1.6468212 debye
polarizability: 380.7832651|-35.9989665|342.3301738|-12.5413995|11.4702528|255.7627372 unknown
InChI: InChI=1S/C23H23N3O8S/c1-23(2)19(22(29)34-12-14-8-10-15(11-9-14)26(30)31)25-20(28)18(21(25)35(23)32)24-17(27)13-33-16-6-4-3-5-7-16/h3-11,18-19,21,24H,12-13H2,1-2H3
charge 0 multiplicity 1
58 atoms
S  -2.346184 -2.717235 2.079551
O  -2.079864 -1.993256 3.554471
O  -0.799395 -3.162892 -2.288961
O  -1.906699 0.720616 -1.233355
O  -4.158853 0.29822 -1.691481
O  1.827396 -5.248011 1.141527
O  3.994908 -2.558787 0.027638
O  -5.027427 6.449827 1.796912
O  -2.853223 6.886033 2.332529
N  -1.491188 -1.85917 -0.35248
N  1.462492 -3.126155 0.222272
N  -3.760226 6.232301 1.68774
C  -0.845399 -2.156506 0.931652
C  -3.45277 -1.253854 1.002566
C  -2.86929 -1.376435 -0.4499
C  0.027968 -3.24367 0.206696
C  -0.756824 -2.821589 -1.096935
C  -4.919168 -1.675408 1.083766
C  -3.12871 0.030012 1.756114
C  -3.061245 -0.04713 -1.196291
C  2.265826 -4.156052 0.678156
C  3.771164 -3.89523 0.586816
C  -2.021023 2.049967 -1.945569
C  -2.477024 3.138954 -0.998625
C  -3.859799 3.426621 -0.848068
C  -1.524446 3.883524 -0.255484
C  5.328548 -2.13012 -0.157238
C  -4.289077 4.438998 0.031693
C  -1.934688 4.898363 0.630482
C  -3.315999 5.158764 0.758607
C  6.4596 -2.910772 0.179404
C  5.479247 -0.837468 -0.712682
C  7.750996 -2.379296 -0.047108
C  6.772959 -0.323658 -0.931298
C  7.91664 -1.090964 -0.599868
H  -0.348796 -1.344621 1.488346
H  -3.469622 -2.111991 -1.020632
H  -0.224623 -4.274549 0.518366
H  -5.287104 -1.607379 2.122376
H  -5.535875 -1.00049 0.458811
H  -5.078727 -2.708301 0.724571
H  -2.983463 -0.214701 2.833222
H  -2.201232 0.509746 1.399801
H  -3.958108 0.755768 1.673261
H  1.938784 -2.300309 -0.154343
H  4.22117 -4.676185 -0.057041
H  4.202972 -3.979305 1.603277
H  -0.995593 2.216713 -2.30777
H  -2.718535 1.921942 -2.790346
H  -4.591487 2.843455 -1.416357
H  -0.456615 3.666532 -0.371189
H  -5.346936 4.680851 0.162456
H  -1.220121 5.485886 1.212513
H  6.355636 -3.911179 0.609605
H  4.585479 -0.258343 -0.965197
H  8.628397 -2.981662 0.212771
H  6.8888 0.676965 -1.361835
H  8.920175 -0.688585 -0.771114
