program: Gaussian 09
title: 000121849
version: EM64L-G09RevD.01
frameworkgroup: C1[X(C11H14FNO2)]
method: RPBEPBE
basis: SDD
operation: Freq
keyword: #p
keyword: freq=noraman
keyword: PBEPBE/SDD
title: #p freq=noraman PBEPBE/SDD
converged: YES YES NO NO
title: Mulliken charges:
elementType: F O O N C C C C C C C C C C C H H H H H H H H H H H H H H
charge: -0.208708 -0.291008 -0.278754 -0.587231 0.408070 0.311755 -0.539982 0.215646 -0.429297 0.218310 -0.352830 -0.538341 -0.253396 -0.521308 -0.535461 0.262984 0.240272 0.238514 0.187607 0.254540 0.231852 0.281081 0.290735 0.212299 0.257365 0.230722 0.221142 0.228061 0.245359
chargesum: 0.00000
title: Mulliken charges with hydrogens summed into heavy atoms:
elementType: F O O N C C C C C C C C C C C
charge: -0.208708 -0.291008 -0.278754 -0.015415 0.408070 0.311755 -0.276998 0.215646 -0.189024 0.218310 -0.114316 -0.096195 -0.021545 0.179079 0.159102
polarizability: 2.04362836e+02 7.46928077e+00 1.40359260e+02 -5.57575436e+00 3.61161857e-01 8.36108665e+01
1716.lowfreq: -4.8113 -0.0010 -0.0008 -0.0005 5.6484 10.0872 38.9781 53.8452 67.0266
frequency: 38.9693 53.8375 67.0054 91.0817 110.4222 114.4533 133.9365 171.7065 190.7184 206.6459 222.5085 246.9870 252.1543 276.8780 294.3648 327.3162 350.6434 376.7602 417.6661 461.5296 495.7227 522.2892 573.4152 578.7279 608.3744 667.2500 708.1159 713.4076 732.1967 797.4929 812.6020 833.0732 895.4814 929.2785 936.6991 976.4294 984.5226 1006.5391 1053.2622 1091.6220 1111.2040 1112.4535 1121.5610 1142.0301 1155.4130 1158.5735 1199.4791 1234.1765 1250.7335 1264.7116 1285.9797 1318.3249 1365.8255 1388.3365 1408.3713 1433.5320 1441.4799 1457.2650 1467.0692 1473.7207 1480.9761 1491.8287 1498.6725 1565.1253 1612.2709 1628.8583 1658.5809 2839.9937 2963.0392 2976.0517 3052.9202 3065.9128 3084.3448 3125.8386 3127.6911 3135.6523 3159.3956 3163.0459 3179.7657 3474.1836 3608.5741
redmass: 4.3934 3.5225 2.4550 3.5913 4.3499 4.9038 1.8409 2.0604 2.5936 1.3586 2.8514 1.5274 1.9077 4.6384 4.0273 4.9780 3.6600 4.5867 4.2106 3.7453 4.4033 1.4613 3.1251 5.2182 5.0539 3.8138 3.8915 5.1391 3.3614 1.4196 1.5065 4.9517 1.5585 1.3419 5.2249 1.9114 7.8187 2.8473 3.7840 2.9141 1.2389 1.2575 2.5196 1.4882 1.3515 1.4922 1.6872 2.2736 1.1748 1.6128 1.5678 2.0487 4.2760 1.5782 2.5293 1.2817 1.3459 1.0692 1.0508 1.0948 1.0532 1.1186 2.4143 7.0100 6.5183 1.0955 7.7422 1.0721 1.0327 1.0346 1.1041 1.0864 1.0974 1.0997 1.1044 1.0877 1.0920 1.0942 1.0961 1.0444 1.0990
irintensity: 0.2668 3.6745 2.9403 1.7409 5.2791 2.2515 0.4320 6.2028 0.3737 43.1087 7.9831 21.8328 15.8530 1.2260 3.6489 7.8428 6.5938 2.9908 2.4539 4.0099 7.8371 159.1191 46.6218 12.1373 11.7358 17.7820 3.9107 16.8868 1.0110 67.8809 10.7772 4.9120 20.6906 1.8512 78.2661 36.7475 39.9224 12.7980 115.1534 54.1189 8.0056 0.1866 47.7789 6.7792 4.5310 23.4547 39.6382 180.0876 14.8549 58.6613 37.0590 36.6497 38.7865 7.7248 5.9666 0.5002 19.9339 12.9175 15.9282 71.8074 23.7592 27.8478 99.4809 32.3739 13.0095 44.0896 46.6020 106.6634 71.0320 84.2515 44.2368 16.7981 37.8013 23.6147 17.7751 6.8629 10.8625 5.8329 13.3289 0.9026 2.2133
temp: 298.150 k
press: 1.00000 atm
elementType: 9 8 8 7 6 6 6 6 6 6 6 6 6 6 6 1 1 1 1 1 1 1 1 1 1 1 1 1 1
symmnumber: 1
zpe: 604144.4 jmol-1
zpe.correction: 0.230106 hartree
zpe.thermalcorrener: 0.246225 hartree
zpe.thermalcorrenthalpy: 0.247170 hartree
zpe.thermalcorrgfe: 0.186299 hartree
zpe.sumelectzpe: -731.408463 hartree
zpe.sumelectthermal: -731.392344 hartree
zpe.sumelectthermalent: -731.391400 hartree
zpe.sumelectthermalfe: -731.452270 hartree
dipole: -3.6492 -4.0515 0.6983
dipole: 5.4972
quadrupole: -85.0833 -78.0448 -90.3577
quadrupole: -1.2455 -1.9985 1.2982
quadrupole: -0.5880 6.4505 -5.8625 -1.2455 -1.9985 1.2982
hfenergy: -731.6385692 hartree
pointgroup: C01 [X(C11H14F1N1O2)]
dipole: -1.4563113 -0.8985578 1.322584 debye
polarizability: 204.6356048|1.6591076|110.8183726|-7.7384211|-28.339967|112.8789851 unknown
InChI: InChI=1S/C11H14FNO2/c1-14-10-4-3-8(5-11(10)15-2)9(6-12)7-13/h3-6H,7,13H2,1-2H3
charge 0 multiplicity 1
29 atoms
F  4.414276 0.556181 -1.370521
O  -2.026182 1.594854 -1.429418
O  -3.297878 -0.389608 0.173824
N  2.945544 0.377104 2.298163
C  0.958778 -0.090767 0.014139
C  2.441533 0.00089 -0.092017
C  0.105144 0.801959 -0.691164
C  -1.297379 0.706104 -0.621716
C  0.34851 -1.072445 0.838531
C  -1.894536 -0.31536 0.183988
C  -1.05587 -1.182911 0.921896
C  3.294371 -0.413724 1.102554
C  3.010975 0.430664 -1.244785
C  -3.122477 2.364116 -0.803758
C  -3.922146 -1.478339 0.930719
H  0.515458 1.621612 -1.2890
H  0.969251 -1.783617 1.394453
H  -1.490935 -1.966079 1.550139
H  3.184636 -1.520009 1.240569
H  4.354631 -0.23288 0.859813
H  2.504695 0.695295 -2.177257
H  3.595401 0.276994 3.081581
H  1.961912 0.322054 2.575897
H  -2.732906 2.977875 0.031502
H  -3.920007 1.69564 -0.441835
H  -3.497008 3.019522 -1.604673
H  -3.714658 -1.387828 2.014698
H  -3.578373 -2.465261 0.566024
H  -5.00156 -1.370335 0.749456
