program: Gaussian 09
title: 000014567
version: EM64L-G09RevD.01
frameworkgroup: C1[X(C10H11NO3)]
method: RPBEPBE
basis: SDD
operation: Freq
keyword: #p
keyword: freq=noraman
keyword: PBEPBE/SDD
title: #p freq=noraman PBEPBE/SDD
converged: YES YES NO NO
title: Mulliken charges:
elementType: O O O N C C C C C C C C C C H H H H H H H H H H H
charge: -0.260294 -0.422088 -0.205595 -0.047939 0.319027 0.108898 -0.357834 -0.350626 -0.800561 -0.240307 -0.227260 -0.233625 -0.308687 0.174685 0.239543 0.267414 0.238506 0.295010 0.238736 0.226779 0.227824 0.230515 0.251301 0.251198 0.385380
chargesum: 0.00000
title: Mulliken charges with hydrogens summed into heavy atoms:
elementType: O O O N C C C C C C C C C C
charge: -0.260294 -0.036708 -0.205595 -0.047939 0.319027 0.108898 -0.118291 -0.083211 -0.028309 -0.013528 0.000564 -0.003110 0.193813 0.174685
polarizability: 2.11319192e+02 1.28911972e+00 1.28828574e+02 -1.22392562e-01 -9.36902247e-02 5.90600437e+01
1716.lowfreq: -8.5945 -0.4628 -0.0008 -0.0008 0.0005 4.6062 20.4805 27.4345 47.3518
frequency: 20.3984 27.4156 47.3390 62.3954 105.3929 128.4287 147.5196 151.5839 256.6163 277.9661 282.5112 361.0346 401.2847 444.7593 452.9205 459.7696 499.4286 565.2891 584.8511 614.9007 627.1779 644.0860 697.0202 768.6259 774.3503 853.9898 854.0678 903.8763 931.3270 981.7083 984.5526 989.3825 999.8682 1002.5219 1007.2707 1024.0253 1038.1743 1071.6577 1086.4066 1099.6693 1173.8773 1178.9089 1192.4590 1254.6681 1313.8823 1323.7704 1365.7144 1381.0121 1388.4612 1433.1399 1448.6811 1457.7165 1482.1280 1486.2047 1554.6523 1590.9663 1613.1553 1695.0729 2991.6568 2993.0536 3048.6433 3068.6950 3126.3874 3133.9791 3136.5743 3151.7029 3162.2793 3171.3255 3524.2088
redmass: 7.1837 4.1306 4.1061 5.9512 2.5280 3.1074 1.2697 6.6263 6.2884 6.1776 4.2706 4.6530 2.8277 3.5982 5.4627 5.2146 1.8168 2.8668 4.7497 6.3871 1.4354 6.1755 1.7809 4.3155 1.7901 4.6127 1.3152 5.6629 1.4115 2.4048 1.3749 5.4072 1.9443 1.3315 4.7234 2.3894 1.5895 2.7004 1.7603 2.3112 1.0544 1.0825 1.1218 1.6035 1.7591 2.4113 1.7930 5.2837 1.2834 2.3024 1.0835 1.1267 1.0480 2.3667 5.0091 6.4433 6.1168 9.0968 1.0412 1.0541 1.1039 1.0973 1.0848 1.0967 1.0891 1.0929 1.0957 1.0998 1.0642
irintensity: 1.0258 0.0032 0.8090 1.1970 10.5823 0.0374 3.2976 6.5926 0.2963 0.2725 0.4150 0.5212 0.0350 3.0428 27.3794 16.2456 28.5644 8.6641 34.0003 0.0501 147.3493 12.0752 52.1563 17.4028 56.4025 45.1819 3.0404 110.1468 4.3992 10.4583 0.1238 0.1140 0.5273 0.3478 586.0169 7.0078 0.4513 29.0911 1.8559 4.4580 0.1078 0.3963 1.8657 31.2589 13.7508 24.3081 13.9376 3.1024 35.8908 13.6752 35.6584 19.8897 20.3397 9.6454 7.3281 2.0504 0.7637 214.0123 39.9086 42.4612 13.5842 12.9367 0.9676 5.5012 9.6762 26.8271 23.0428 13.2981 33.6286
temp: 298.150 k
press: 1.00000 atm
elementType: 8 8 8 7 6 6 6 6 6 6 6 6 6 6 1 1 1 1 1 1 1 1 1 1 1
symmnumber: 1
zpe: 502877.4 jmol-1
zpe.correction: 0.191536 hartree
zpe.thermalcorrener: 0.205355 hartree
zpe.thermalcorrenthalpy: 0.206299 hartree
zpe.thermalcorrgfe: 0.148193 hartree
zpe.sumelectzpe: -667.007077 hartree
zpe.sumelectthermal: -666.993258 hartree
zpe.sumelectthermalent: -666.992314 hartree
zpe.sumelectthermalfe: -667.050420 hartree
dipole: 0.8122 -0.9103 -0.0014
dipole: 1.2199
quadrupole: -64.4457 -78.0564 -84.1236
quadrupole: 9.0801 -0.0039 -0.0115
quadrupole: 11.0962 -2.5145 -8.5817 9.0801 -0.0039 -0.0115
hfenergy: -667.1986126 hartree
pointgroup: C01 [X(C10H11N1O3)]
dipole: -0.3270463 0.3512587 0.0045581 debye
dipolederiv: -1.8936226 -0.2861855 0.0252507 0.360176 -0.1929478 -0.0053495 0.0233807 0.004551 -0.2390179 -1.0062158 -0.5831136 0.0081702 -0.5692825 -0.7956331 0.0088617 0.008518 0.0093612 -0.4366928 -0.7443768 0.1912415 0.0074306 -0.0623366 -0.925935 0.000227 0.0073693 -0.004085 -0.2978991 0.874347 0.1754228 -0.0150808 -0.6567183 -0.3266519 0.0104459 -0.0119226 -0.0023002 -0.1344488 0.1930662 0.0424299 -0.0030207 -0.0035346 -0.1241281 0.000276 -0.0045297 -0.0003103 -0.0108339 0.2931049 -0.1860321 -0.0041277 -0.2618016 0.4271144 0.0026247 -0.002776 0.0021031 0.0088267 -0.1110677 -0.0578144 -0.0006355 -0.0182763 0.0487251 0.0006305 -0.0005468 0.0014648 -0.1613355 -0.0907929 0.0892654 0.0001783 0.0818935 -0.0343552 -0.0006133 0.0001687 -0.0009545 -0.1316105 -0.1436228 0.0316085 0.0037629 0.0978096 -0.2873628 -0.0007392 0.0032796 -0.0000013 0.1028665 0.0487117 0.1106872 -0.0022566 0.1907014 -0.0050378 -0.0020117 -0.0018451 -0.0009483 -0.1528986 -0.069424 -0.0498594 -0.0011859 -0.0864827 0.1530968 0.0023143 -0.0013792 0.0015794 -0.1512711 0.0099 -0.0370621 -0.002132 -0.0434047 -0.0296361 0.0008991 -0.0023189 0.0009642 -0.1611051 0.5973683 0.2964398 -0.0036198 0.9844784 0.2680275 -0.0151953 -0.006068 -0.0047553 0.3642019 1.6240223 0.2250259 -0.0224179 0.2724602 1.462918 -0.0028761 -0.0225228 -0.0022039 0.210984 0.1145603 0.0456248 0.0005578 0.0416827 -0.0923201 -0.001227 0.0006654 -0.0013967 0.1442747 0.0528061 -0.0937488 0.0006144 -0.076796 0.0416159 0.0005923 0.0005784 0.0009894 0.1485118 0.0672326 -0.0551372 -0.1005217 -0.058201 0.0497257 -0.032867 -0.0900152 -0.0656104 -0.0216987 -0.0328829 0.0971784 0.0020731 0.0237507 0.1322949 -0.000388 0.0022191 -0.0013983 0.1224477 0.0725537 -0.0526141 0.0976992 -0.0568336 0.0500731 0.0343976 0.0872887 0.0669128 -0.0274258 -0.0553476 -0.0967991 0.0024642 -0.1191254 -0.008818 0.0010106 0.0023329 0.0007137 0.1584738 0.0624447 0.0405824 0.0013128 0.0694265 -0.1195434 -0.0018576 0.0013522 -0.00151 0.1553044 -0.1185665 0.0659872 0.0037935 0.0697338 0.0697947 -0.0011864 0.0038343 -0.0011263 0.1621744 0.0260593 -0.0066472 -0.0141946 -0.1666224 0.0022859 0.0729693 0.0485056 0.0994266 -0.0276046 0.0242038 -0.0102785 0.0123481 -0.1694959 0.0014234 -0.0680334 -0.049178 -0.0993971 -0.0261212 0.2055387 0.1037981 0.0035372 0.1567986 0.235274 -0.0029047 0.0036094 -0.0020686 0.4018977 unknown
polarizability: 211.1953223|3.041145|128.9204907|-2.2062144|0.0682103|59.0919967 unknown
InChI: InChI=1S/C10H11NO3/c1-8(11-14-7-10(12)13)9-5-3-2-4-6-9/h2-6,12H,7H2,1H3
charge 0 multiplicity 1
25 atoms
O  1.913905 -0.312759 -0.047188
O  5.160294 1.325012 -0.102599
O  4.609825 -0.939498 -0.09664
N  0.562154 0.261219 -0.028632
C  -1.774437 -0.205643 0.006528
C  -0.361901 -0.686452 -0.013243
C  -2.850619 -1.13494 0.017469
C  -2.080374 1.187289 0.014939
C  -0.061006 -2.170871 -0.015256
C  -4.190625 -0.688781 0.03579
C  -3.416592 1.628651 0.033193
C  -4.481071 0.69333 0.043646
C  2.842858 0.814539 -0.065016
C  4.253282 0.251683 -0.088953
H  -2.648703 -2.210753 0.011631
H  -1.255882 1.906311 0.007027
H  -0.513367 -2.656034 -0.899587
H  1.022906 -2.350049 -0.030956
H  -0.487841 -2.652985 0.883257
H  -5.00597 -1.420692 0.043861
H  -3.633276 2.702824 0.039553
H  -5.520516 1.039453 0.057904
H  2.682688 1.448368 -0.957954
H  2.7140 1.451249 0.83092
H  6.090168 0.97073 -0.119094
