program: Gaussian 09
title: 000121808
version: EM64L-G09RevD.01
frameworkgroup: C1[X(C6H12O2)]
method: RPBEPBE
basis: SDD
operation: Freq
keyword: #pfreq=noraman
keyword: PBEPBE/SDD
title: #p freq=noraman PBEPBE/SDD
converged: YES YES NO NO
title: Mulliken charges:
elementType: O O C C C C C C H H H H H H H H H H H H
charge: -0.449744 -0.445524 -0.532154 0.495467 -0.319581 -0.381017 -0.836961 -0.370504 0.196501 0.234493 0.195895 0.197618 0.240615 0.216427 0.245801 0.224404 0.224546 0.187285 0.344487 0.331947
chargesum: 0.00000
title: Mulliken charges with hydrogens summed into heavy atoms:
elementType: O O C C C C C C
charge: -0.105257 -0.113577 -0.101160 0.495467 0.073932 -0.140401 -0.150330 0.041326
polarizability: 9.52979016e+01 9.37819925e+00 6.61308236e+01 3.16041936e+00 6.59461982e-01 6.23878595e+01
1716.lowfreq: -9.1134 0.0002 0.0010 0.0011 5.3118 7.2211 32.7523 72.5284 81.4722
frequency: 31.8524 72.4931 81.4626 129.7314 174.3629 231.3060 269.1606 294.1022 343.3340 357.4832 389.2506 466.7800 487.5962 558.3979 752.1976 820.6435 869.9933 920.1951 937.2415 961.8568 981.1346 1019.9522 1046.9801 1054.0336 1113.5287 1148.4089 1174.6572 1191.4218 1224.6956 1260.8024 1286.3404 1336.8098 1352.6559 1378.8483 1390.3342 1403.6144 1438.6656 1459.4736 1469.3935 1476.9622 1488.7296 1685.4329 2935.9391 2958.6729 2969.0445 2979.3169 2985.3959 3041.1655 3052.1306 3054.6604 3089.5446 3099.5706 3552.2062 3566.8828
redmass: 4.0454 3.0078 4.0632 2.3455 1.3391 1.7870 1.3326 1.7499 1.4843 2.1131 2.5754 2.8148 2.5714 2.4486 2.2894 1.7220 2.0967 2.2239 2.7078 1.6810 1.8238 2.0011 2.0001 1.8812 2.4227 1.1616 1.1729 1.1973 1.6371 1.2339 1.2487 1.6702 1.2087 1.2901 1.2916 1.3849 1.1011 1.0796 1.0561 1.0799 1.0752 6.8497 1.0552 1.0641 1.0398 1.0642 1.1060 1.0970 1.0951 1.0973 1.0957 1.0904 1.0662 1.0664
irintensity: 0.9742 2.0081 3.7965 3.4796 1.9316 18.1790 159.3064 4.0436 91.7823 34.4511 21.6557 14.0233 2.7536 15.6383 2.4781 26.6643 8.2060 82.7941 53.4195 3.2252 12.7373 42.7719 21.9732 20.4902 5.0201 11.0495 20.4846 4.2175 4.5458 17.3760 19.9030 1.4875 23.9565 20.3142 21.4748 1.5119 11.2218 9.2324 11.6995 12.8220 7.6457 14.4785 48.9609 49.4309 38.0112 54.0938 83.9491 22.2536 36.5266 23.7609 24.6044 29.8302 4.1262 3.2312
temp: 298.150 k
press: 1.00000 atm
elementType: 8 8 6 6 6 6 6 6 1 1 1 1 1 1 1 1 1 1 1 1
symmnumber: 1
zpe: 447504.1 jmol-1
zpe.correction: 0.170445 hartree
zpe.thermalcorrener: 0.180795 hartree
zpe.thermalcorrenthalpy: 0.181740 hartree
zpe.thermalcorrgfe: 0.134102 hartree
zpe.sumelectzpe: -385.573287 hartree
zpe.sumelectthermal: -385.562936 hartree
zpe.sumelectthermalent: -385.561992 hartree
zpe.sumelectthermalfe: -385.609630 hartree
dipole: 3.9456 2.1840 0.9955
dipole: 4.6183
quadrupole: -50.9997 -50.3931 -46.6336
quadrupole: -2.8753 -2.2538 -0.4169
quadrupole: -1.6575 -1.0510 2.7085 -2.8753 -2.2538 -0.4169
hfenergy: -385.7437318 hartree
pointgroup: C01 [X(C6H12O2)]
dipole: 1.5799581 -0.8709722 -0.2157597 debye
dipolederiv: -0.2080893 -0.117346 0.0625953 -0.2063909 -0.6460093 -0.143091 -0.0047308 -0.130909 -0.6901192 -0.8868845 -0.0518908 -0.1542337 -0.1628367 -0.3818511 0.1677813 -0.2207096 0.1729846 -0.4548071 -0.0407458 -0.046535 -0.0406024 0.0544554 0.0729044 0.0402542 -0.034359 0.0629501 0.0542091 0.2498505 -0.0627878 -0.0824879 -0.1200643 0.1904772 -0.1331185 -0.0827431 -0.1934388 0.0119351 0.2812568 0.0779824 0.0083759 0.0754829 0.5290322 0.1598188 0.067734 0.1598025 0.5650822 -0.2994078 -0.0003696 -0.1422674 -0.0253531 -0.0344134 -0.0799444 -0.0893586 -0.05229 -0.2467712 -0.0306825 0.0279808 0.0115717 -0.0223995 -0.0820145 0.1216443 0.0101968 0.1424117 -0.0023818 0.6286116 -0.0545829 0.1825784 0.120633 0.2993986 -0.0201491 0.1776575 -0.0233046 0.4874089 -0.0156045 0.0209316 0.0441646 0.0288206 -0.014587 -0.1486971 0.0768125 -0.1089231 -0.0576987 0.0274484 0.0420388 -0.0315647 0.0015173 -0.098435 0.1203268 0.0106841 0.0728084 0.0512216 -0.1723233 -0.0360094 0.1460597 -0.0988724 0.0048183 0.0013384 0.125741 -0.0205074 -0.103229 0.0700064 0.0448043 -0.0111231 0.0655359 -0.2261328 0.0190232 -0.0559482 0.0564917 -0.0421948 0.0766996 -0.0133977 0.0520409 -0.0038878 -0.0682525 0.1090789 0.0880602 0.1064284 0.0652452 0.0409616 0.1008689 0.0680722 0.1088795 -0.045689 -0.0583463 0.0785836 -0.1225364 -0.0044705 0.0132342 0.0217721 -0.1202568 0.0304214 0.0560924 -0.019066 -0.1409134 0.0229276 -0.0358446 -0.0871465 -0.1325954 0.081949 -0.0649585 0.0644903 0.0309429 0.0664849 0.0416058 0.0707227 -0.0436652 0.0595556 0.0318546 0.0444606 -0.0143418 -0.1312667 0.0124974 -0.0845044 -0.032311 0.0231814 0.0069637 -0.0528885 -0.0231752 -0.1467526 0.1565699 -0.0264499 0.0975219 -0.0343071 0.0317242 0.0228736 -0.1395191 0.0777669 0.339385 -0.0373308 -0.1139392 -0.0521591 0.2671621 0.3415747 0.0897429 0.0856813 0.119965 0.2018805 -0.1557687 0.0546997 -0.14736 0.1311481 unknown
polarizability: 95.7761096|-9.1136892|65.8603619|-0.5992573|-0.2393912|62.1801132 unknown
InChI: InChI=1S/C6H12O2/c1-6(2-4-7)3-5-8/h2,7-8H,3-5H2,1H3
charge 0 multiplicity 1
20 atoms
O  2.477968 0.988563 0.913904
O  -3.473372 0.287252 -0.41502
C  1.318166 0.021754 -0.983301
C  0.08286 -0.400989 -0.194102
C  2.629135 0.015715 -0.179037
C  -1.013935 0.411153 -0.163498
C  0.1845 -1.738609 0.517398
C  -2.331323 0.155544 0.52461
H  1.463066 -0.674238 -1.838176
H  1.170651 1.033293 -1.403223
H  3.466817 0.299503 -0.852256
H  2.835968 -1.000074 0.221651
H  -0.96621 1.373323 -0.694425
H  0.644815 -2.501981 -0.139699
H  0.827754 -1.651506 1.41463
H  -0.794233 -2.119069 0.85289
H  -2.536369 0.92964 1.284767
H  -2.357396 -0.832837 1.025691
H  3.326877 1.054162 1.419298
H  -3.269038 -0.255098 -1.219403
