program: Gaussian 09
title: 000121807
version: EM64L-G09RevD.01
frameworkgroup: C1[X(C8H8N3O2)]
method: RPBEPBE
basis: SDD
operation: Freq
keyword: #p
keyword: freq=noraman
keyword: PBEPBE/SDD
title: #p freq=noraman PBEPBE/SDD
converged: YES YES NO NO
title: Mulliken charges:
elementType: O O N N N C C C C C C C C H H H H H H H H
charge: -0.362202 -0.211233 -0.265845 0.143664 0.175907 -0.270925 0.445948 -0.345476 -0.382502 0.190978 -0.203612 -0.203513 -0.206297 0.325312 0.258139 0.250274 0.437521 0.262624 0.265054 0.267725 0.428458
chargesum: 1.00000
title: Mulliken charges with hydrogens summed into heavy atoms:
elementType: O O N N N C C C C C C C C
charge: 0.066256 -0.211233 0.171676 0.143664 0.175907 0.054387 0.445948 -0.087337 -0.132228 0.190978 0.059012 0.061541 0.061428
polarizability: 2.04675734e+02 -1.09227575e+01 7.63885916e+01 2.97821368e+00 6.10502028e+00 9.10613105e+01
1716.lowfreq: -9.9619 -0.0006 -0.0006 -0.0003 0.7836 9.9331 29.3138 39.2720 60.0215
frequency: 29.3027 39.2502 59.9947 80.2598 133.6075 180.9756 224.5238 259.7727 310.2035 337.0411 365.3536 399.8241 461.6406 470.7582 499.8060 540.1618 608.2231 625.5603 645.7314 685.5635 697.3483 768.6688 828.9435 833.2171 852.1597 934.0561 964.6458 988.7817 990.3708 1018.2017 1024.0122 1063.0658 1091.1698 1100.9095 1186.7564 1193.5727 1200.9618 1242.1473 1261.4040 1331.8645 1341.1266 1393.2777 1395.5245 1447.5549 1479.3773 1583.5366 1598.3649 1653.0620 2106.5941 3036.5373 3123.7409 3133.7521 3156.9047 3169.9623 3183.3537 3459.1887 3513.8148
redmass: 5.3450 9.2804 4.6818 5.3616 6.3757 4.9841 4.8531 4.8995 3.6839 3.0261 4.9984 2.8481 4.6191 4.0077 3.6299 4.0503 6.2779 1.7997 3.1465 4.0720 1.9152 1.7464 4.7419 5.2743 1.2703 1.6012 3.3826 4.1313 1.5716 1.3808 2.1712 2.1914 1.6764 5.9823 1.0857 1.2597 1.5326 1.2221 1.8943 1.9254 1.4474 2.1603 2.0780 2.1550 2.1847 5.7314 5.8019 10.8952 12.6367 1.0848 1.0910 1.0910 1.0899 1.0954 1.1013 1.0804 1.0652
irintensity: 1.9248 0.7983 2.5324 1.1415 0.6086 9.3066 27.3769 4.4369 43.0158 44.0278 41.2869 1.7203 4.4329 10.1041 31.8567 80.2054 6.9498 171.1780 43.2362 35.0140 57.6078 70.6932 19.0445 36.9622 1.3525 2.6387 8.1778 6.8827 1.1631 0.7426 0.0084 206.7815 8.3854 53.2168 4.6005 36.3149 23.1081 8.2613 26.2377 41.7530 14.4814 37.6822 41.2743 17.5744 3.2919 3.1362 41.7798 175.6668 280.8100 1.5365 1.6503 1.8919 0.3633 4.3989 5.4465 95.8982 118.5171
temp: 298.150 k
press: 1.00000 atm
elementType: 8 8 7 7 7 6 6 6 6 6 6 6 6 1 1 1 1 1 1 1 1
symmnumber: 1
zpe: 402576.2 jmol-1
zpe.correction: 0.153333 hartree
zpe.thermalcorrener: 0.165519 hartree
zpe.thermalcorrenthalpy: 0.166463 hartree
zpe.thermalcorrgfe: 0.113173 hartree
zpe.sumelectzpe: -623.078763 hartree
zpe.sumelectthermal: -623.066577 hartree
zpe.sumelectthermalent: -623.065633 hartree
zpe.sumelectthermalfe: -623.118922 hartree
dipole: 1.2296 -2.8656 -0.8176
dipole: 3.2237
quadrupole: -46.0630 -54.6092 -63.9665
quadrupole: -2.8179 -4.4378 -0.1378
quadrupole: 8.8165 0.2704 -9.0869 -2.8179 -4.4378 -0.1378
hfenergy: -623.2320959 hartree
pointgroup: C01 [X(C8H8N3O2)]
dipole: 0.4576646 -0.7345536 -0.9271291 debye
dipolederiv: -0.3328905 0.1550329 0.0761428 0.1008241 -1.156098 -0.1711847 0.0868426 -0.2515881 -0.3457508 -0.5986394 0.2525568 -0.1494915 0.089633 -0.6579592 -0.0948526 -0.318476 -0.0436537 -0.4965653 -0.9921782 0.0693424 -0.0609999 0.3465618 -0.0814394 -0.0204816 0.0265668 -0.039144 -0.3245707 1.6871938 -0.4723541 -0.1561033 0.633231 0.0503331 0.0024832 0.1634826 0.1520994 0.3467653 -0.9984434 0.4741019 0.2634997 -0.2413073 0.0716218 -0.0365404 -0.0522593 -0.0580623 0.0705273 1.2455086 -0.3532361 -0.329886 -0.7759359 0.4692338 0.0212967 -0.4222722 -0.0569409 0.1538749 -0.6159603 0.1400693 0.1351525 -0.2127263 -0.0985915 -0.032368 0.0162308 -0.0591217 -0.0246041 0.1345974 -0.048132 0.0803623 0.1632624 -0.1502127 -0.0105097 -0.2446651 -0.0021343 -0.0059169 0.2641546 0.0050459 -0.1728675 0.0082638 -0.0695234 -0.0917167 0.2949414 -0.0853541 -0.0087766 0.7213552 -0.3393653 0.3491917 -0.057426 1.3899123 0.3016118 0.4804564 0.3314706 0.659844 -0.3855565 0.08685 -0.0941672 0.0720469 -0.0698025 -0.0907825 -0.2770741 -0.056542 0.103967 -0.1408527 -0.0566034 0.204399 -0.1725285 -0.0700744 -0.0121103 0.30307 -0.0555351 -0.0397172 0.3233931 0.0145775 -0.0382303 0.0138257 -0.0673017 -0.0434486 0.0391444 -0.0525651 0.0011007 0.0797356 0.0226661 -0.0038983 0.0112592 0.0406624 0.0043313 0.049721 0.0230201 0.0349055 0.0211787 0.018744 -0.0851173 0.0198021 0.1377083 0.0246779 -0.0671795 0.0298875 0.0427884 0.0677654 -0.0411446 0.0762856 -0.0163613 0.1139389 0.0684425 0.0494012 0.06169 0.0178121 0.1851211 0.0885505 0.0259751 0.0020393 0.2878467 0.0153781 -0.0244585 0.0050411 0.3511436 0.0712464 -0.0191079 0.0282528 -0.0338117 0.1322553 0.0686986 0.0379966 0.0672423 0.0094138 0.0318678 0.0146907 -0.0595407 0.0033482 0.1459272 0.051441 -0.0736473 0.0502294 0.041967 -0.026101 -0.0233563 0.0151345 -0.0041251 0.1437023 0.0211106 0.0263118 0.020739 0.1093077 0.2575043 0.0110717 -0.1040939 0.0501246 0.4378604 0.0245234 -0.0941336 0.0192218 0.3024843 unknown
polarizability: 203.3339158|-17.0699712|77.2252049|-3.0647161|-5.2932681|91.5665149 unknown
InChI: InChI=1S/C8H8N3O2/c9-11-10-7(8(12)13)6-4-2-1-3-5-6/h1-5,7,10,12H
charge 1 multiplicity 1
21 atoms
O  0.973461 2.234566 0.84074
O  2.425366 0.447224 1.240727
N  1.348711 -1.077805 -0.763966
N  2.628441 -1.314149 -0.745684
N  3.784962 -1.46752 -0.742941
C  0.710389 0.312684 -0.535397
C  -0.765998 0.091395 -0.312762
C  -1.23405 -0.467581 0.908509
C  -1.684423 0.441566 -1.337285
C  1.476246 0.981039 0.631276
C  -2.615561 -0.667012 1.099821
C  -3.067038 0.246922 -1.135267
C  -3.532207 -0.309998 0.079417
H  0.881342 0.906882 -1.452389
H  -0.531397 -0.73006 1.709677
H  -1.326268 0.879367 -2.276784
H  0.731877 -1.88971 -0.914232
H  -2.981902 -1.089385 2.040452
H  -3.777749 0.528737 -1.917785
H  -4.6052 -0.461817 0.233963
H  1.445099 2.719755 1.572411
