program: Gaussian 09
title: 000121889
version: EM64L-G09RevD.01
frameworkgroup: C1[X(C22H26ClNO4)]
method: RPBEPBE
basis: SDD
operation: Freq
keyword: #p
keyword: freq=noraman
keyword: PBEPBE/SDD
title: #p freq=noraman PBEPBE/SDD
converged: YES YES NO NO
title: Mulliken charges:
elementType: Cl O O O O N C C C C C C C C C C C C C C C C C C C C C C H H H H H H H H H H H H H H H H H H H H H H H H H H
charge: -0.072729 -0.246026 -0.472747 -0.275639 -0.198388 -0.422292 -0.028250 -0.480783 -0.552945 -0.557663 0.322449 0.301110 -0.437850 -0.565518 -0.408452 -0.189382 0.346185 -0.368972 0.460604 -0.367073 -0.431294 -0.381929 -0.078060 -0.210045 -0.245806 0.219140 -0.217500 -0.671165 0.215829 0.192803 0.230539 0.232332 0.226641 0.219671 0.227037 0.266903 0.224953 0.239471 0.267349 0.229834 0.202981 0.247162 0.362258 0.309236 0.232451 0.240984 0.239181 0.229018 0.255426 0.231470 0.232638 0.229844 0.230492 0.214516
chargesum: 0.00000
title: Mulliken charges with hydrogens summed into heavy atoms:
elementType: Cl O O O O N C C C C C C C C C C C C C C C C C C C C C C
charge: -0.072729 -0.246026 -0.110489 -0.275639 -0.198388 -0.155388 0.187579 -0.057441 -0.093972 -0.110955 0.322449 0.301110 0.026574 -0.298169 -0.178618 0.013598 0.346185 -0.121810 0.460604 -0.057837 -0.198842 0.098235 -0.078060 0.018973 0.009620 0.219140 0.246608 0.003687
polarizability: 3.33514327e+02 -1.19378529e+01 3.09289677e+02 -2.09377629e+01 9.09763499e+00 1.70803460e+02
1716.lowfreq: -5.1980 -2.9630 0.0006 0.0012 0.0018 3.0985 4.9216 8.3843 12.6268
frequency: 4.5443 8.3574 12.3618 27.2792 30.0731 37.8405 47.8538 49.6993 63.8595 96.7595 103.2725 116.2216 123.3347 147.2122 151.5166 169.4958 175.1889 181.9627 204.2590 216.6748 228.4928 242.9636 253.3600 288.5086 306.4543 326.6637 334.8455 360.5680 371.9219 390.6658 397.3690 417.5052 436.5066 444.6175 457.1599 470.0159 487.8079 535.9193 552.1614 564.9365 569.4573 581.3301 608.2782 640.0339 664.0063 675.1622 683.9722 701.4784 707.3039 726.5353 753.6147 784.1259 788.2446 798.9292 800.3261 823.4476 830.9628 839.3083 881.7979 894.6311 898.0089 907.5273 916.2196 918.5425 923.3481 930.6630 944.0531 971.5474 984.5359 988.2139 1003.4852 1012.9156 1019.5168 1034.8718 1039.8200 1056.9078 1067.0981 1073.1299 1094.1286 1110.4190 1117.4271 1118.9449 1126.2800 1136.1072 1137.8613 1138.1448 1168.1460 1173.8434 1192.0391 1200.7414 1201.2859 1209.1221 1225.7758 1240.8211 1250.3779 1255.4072 1259.0836 1259.9965 1280.2055 1296.0824 1307.1990 1308.1229 1328.6343 1340.0167 1345.4002 1349.5290 1365.4730 1374.6321 1383.3843 1389.9392 1395.5213 1400.9818 1421.3509 1428.2298 1450.4125 1453.4432 1455.5658 1460.5986 1462.5454 1462.7692 1468.2920 1472.6698 1474.4827 1486.6959 1498.7722 1578.2027 1582.6987 1608.0201 1627.1986 1680.0676 2892.0628 2908.7648 2953.5223 2957.5301 2958.1589 2969.8523 2974.6662 2996.9583 3011.8443 3013.6045 3020.5229 3032.6511 3039.9323 3068.0933 3070.7966 3093.6356 3108.6723 3116.5644 3120.6598 3146.2084 3147.2764 3160.1288 3174.0692 3181.8153 3218.2404 3428.6409
redmass: 4.7513 10.2285 6.0372 5.0717 4.4067 5.5033 4.2281 3.5364 3.7089 3.2022 3.1506 3.7538 3.5966 3.7870 2.8446 4.2421 4.8903 4.5907 3.3304 4.0503 3.3776 1.3064 4.7154 3.6496 5.6434 3.7019 3.9766 3.6871 4.8971 6.1227 4.5174 3.3265 2.4806 3.2878 3.1567 3.2589 4.2853 4.1225 4.0837 3.2587 3.9157 3.4942 3.7268 3.8708 2.0946 3.8824 3.6049 2.2243 3.0628 4.2859 5.0566 1.4162 1.1883 1.1052 1.4485 2.9193 2.1708 3.0466 1.4770 2.5161 1.5649 3.2451 1.7406 2.5362 1.4265 3.4487 1.4135 1.3446 5.5107 3.8132 1.8647 2.6742 2.5401 3.8661 3.8476 2.2571 2.0011 2.1527 1.6878 2.5060 2.0046 3.2121 3.1626 1.4854 1.4729 1.6910 1.7046 1.0910 1.5650 1.6669 1.0855 2.0275 1.3817 1.4140 1.1337 1.8016 1.4742 1.5133 1.2339 1.2136 1.3691 1.2659 1.3318 1.5189 1.4574 1.3633 1.6988 1.6334 6.1666 3.3364 1.5534 1.2787 2.5362 3.1779 1.1824 1.1720 1.1427 1.1255 1.6986 1.0401 1.4229 1.1024 1.0591 1.0716 2.5177 6.7400 6.8908 6.8229 6.9755 10.7742 1.0824 1.0830 1.0680 1.0573 1.0628 1.0623 1.0620 1.0358 1.0583 1.1034 1.0950 1.0980 1.1013 1.0942 1.1067 1.0985 1.1028 1.0890 1.0880 1.0918 1.0928 1.0940 1.0970 1.0925 1.0630 1.0742
irintensity: 0.7083 0.2124 0.5407 0.8602 0.2706 1.1494 1.9000 1.3433 0.2649 0.7564 1.2949 2.4253 3.1342 3.2055 9.5925 2.9257 3.5545 1.4388 0.5390 0.8775 0.5518 2.3710 2.9042 6.9944 8.4618 6.9519 7.0405 2.7728 6.5051 6.9566 0.4161 1.3502 5.7194 2.7103 2.7055 1.3680 1.9622 1.7098 0.2109 2.1823 3.1444 6.1762 5.0004 1.2067 16.4353 27.6855 10.6217 44.8190 6.2504 6.1907 21.2073 4.7504 205.7703 10.9667 40.5500 7.4229 9.9124 10.8652 3.2874 43.1593 5.1946 6.7860 19.7253 8.0613 26.4846 4.1633 7.3254 0.1159 3.7885 3.1186 0.4023 12.2646 6.0684 156.5204 94.6428 40.2238 20.1659 25.4615 9.2329 110.2112 55.9946 37.2525 512.6250 8.5761 10.6671 21.8764 52.4332 0.8376 18.7998 22.2916 2.5223 12.3530 17.8744 5.9212 0.0200 56.6582 59.2595 19.4968 5.1712 19.6369 11.6976 5.1577 2.7925 6.6166 14.7407 25.1332 16.5708 28.6526 7.1736 0.9152 65.3357 22.3879 46.5730 25.5735 12.3702 3.8134 44.2033 4.3668 22.9284 12.5153 8.7521 13.9853 7.3511 11.7639 111.9474 37.9102 27.2661 33.9035 90.4652 168.6832 51.0907 58.2605 53.6900 42.7547 38.7381 27.7487 59.8603 21.2258 18.7387 18.6914 34.6012 7.6918 57.8912 17.8697 7.1880 29.2310 44.5075 19.3435 10.0551 1.8699 17.3033 20.0490 7.8371 5.3851 266.1574 0.7664
temp: 298.150 k
press: 1.00000 atm
elementType: 17 8 8 8 8 7 6 6 6 6 6 6 6 6 6 6 6 6 6 6 6 6 6 6 6 6 6 6 1 1 1 1 1 1 1 1 1 1 1 1 1 1 1 1 1 1 1 1 1 1 1 1 1 1
symmnumber: 1
zpe: 1146007.7 jmol-1
zpe.correction: 0.436491 hartree
zpe.thermalcorrener: 0.464204 hartree
zpe.thermalcorrenthalpy: 0.465149 hartree
zpe.thermalcorrgfe: 0.370819 hartree
zpe.sumelectzpe: -1667.552845 hartree
zpe.sumelectthermal: -1667.525132 hartree
zpe.sumelectthermalent: -1667.524188 hartree
zpe.sumelectthermalfe: -1667.618517 hartree
dipole: -3.6366 -6.2768 -3.4182
dipole: 8.0192
quadrupole: -130.1831 -164.5613 -176.2780
quadrupole: -18.7297 -16.9864 -1.2412
quadrupole: 26.8244 -7.5538 -19.2706 -18.7297 -16.9864 -1.2412
hfenergy: -1667.9893364 hartree
pointgroup: C01 [X(C22H26Cl1N1O4)]
dipole: 1.3921398 -2.3691365 1.5501696 debye
polarizability: 334.2657994|10.4149462|306.9627714|-19.5231773|-19.2297881|172.3788936 unknown
InChI: InChI=1S/C22H26ClNO4/c1-2-27-22(26)14-28-20-9-7-15-6-8-19(11-17(15)12-20)24-13-21(25)16-4-3-5-18(23)10-16/h3-5,7,9-10,12,19,21,24-25H,2,6,8,11,13-14H2,1H3
charge 0 multiplicity 1
54 atoms
Cl -4.856554 4.481771 -1.230658
O  3.885548 0.524709 -0.195791
O  -4.07503 -0.709194 -1.972047
O  7.327901 1.64707 -0.104862
O  5.353566 2.874924 -0.357905
N  -2.917844 -2.392348 -0.250626
C  -1.503854 -2.522956 0.202078
C  -0.935956 -3.881339 -0.261477
C  -0.632491 -1.388147 -0.382696
C  0.473922 -4.104197 0.325777
C  0.859359 -1.599327 -0.135185
C  1.38657 -2.891902 0.157176
C  -3.735767 -1.316451 0.363847
C  1.735064 -0.49685 -0.237099
C  2.783099 -3.031574 0.324238
C  -4.774322 -0.822545 -0.700252
C  3.127697 -0.65688 -0.065122
C  3.66675 -1.935912 0.216418
C  -5.384133 0.512114 -0.301371
C  -4.91595 1.710094 -0.893103
C  -6.393493 0.568217 0.692248
C  5.322249 0.404253 -0.024507
C  -5.45856 2.933569 -0.463691
C  -6.919918 1.811912 1.105922
C  -6.453241 3.016647 0.529854
C  5.939001 1.791029 -0.188125
C  8.126591 2.908441 -0.225169
C  9.594877 2.512291 -0.11798
H  -1.43711 -2.485958 1.316503
H  -1.604961 -4.706124 0.058506
H  -0.901623 -3.89253 -1.368566
H  -0.826765 -1.349539 -1.474392
H  -0.93845 -0.404787 0.020542
H  0.379714 -4.339123 1.406846
H  0.939298 -4.992943 -0.141516
H  -3.399301 -3.302383 -0.217456
H  -4.252824 -1.62506 1.297208
H  -3.069783 -0.47235 0.612779
H  1.352521 0.506089 -0.455853
H  3.196848 -4.023797 0.544641
H  -5.586267 -1.582662 -0.777777
H  4.741299 -2.092539 0.349292
H  -3.371148 -1.432025 -1.900964
H  -4.162201 1.652362 -1.682144
H  -6.777061 -0.358809 1.135927
H  5.769614 -0.276576 -0.777141
H  5.581926 0.01782 0.983005
H  -7.700653 1.851947 1.873213
H  -6.856346 3.985641 0.837692
H  7.810724 3.594586 0.581364
H  7.882415 3.379431 -1.194366
H  9.805144 2.030975 0.852346
H  9.87452 1.811657 -0.923123
H  10.230693 3.412178 -0.204359
