program: Gaussian 09
title: 000121821
version: EM64L-G09RevD.01
frameworkgroup: C1[X(C13H12O3)]
method: RPBEPBE
basis: SDD
operation: Freq
keyword: #pfreq=noraman
keyword: PBEPBE/SDD
title: #p freq=noraman PBEPBE/SDD
converged: YES YES NO NO
title: Mulliken charges:
elementType: O O O C C C C C C C C C C C C C H H H H H H H H H H H H
charge: -0.398869 -0.157208 -0.137623 0.232699 -0.565361 0.335385 0.015334 -0.353274 0.295601 -0.160068 -0.207887 -0.377899 -0.683836 -0.373964 -0.221067 -0.231830 0.279408 0.181692 0.196593 0.240551 0.286986 0.202041 0.225163 0.226161 0.291358 0.239617 0.242395 0.377900
chargesum: 0.00000
title: Mulliken charges with hydrogens summed into heavy atoms:
elementType: O O O C C C C C C C C C C C C C
charge: -0.020970 -0.157208 -0.137623 0.232699 -0.104261 0.335385 0.015334 0.083869 0.295601 -0.160068 -0.207887 -0.090912 -0.030471 -0.082606 0.018550 0.010565
polarizability: 2.19200115e+02 -1.92673193e+01 1.74049721e+02 1.05112489e+01 2.02994012e+00 7.50783547e+01
1716.lowfreq: -0.0008 -0.0004 -0.0004 4.3124 7.5618 8.7247 41.7336 52.3257 56.7186
frequency: 41.4149 52.2916 56.6814 80.4564 124.0047 145.8512 186.8643 225.3129 251.0171 266.4663 320.7966 338.5284 351.2306 363.7243 401.4736 412.9342 420.6905 460.4838 486.2487 499.3296 564.0051 622.8584 650.7833 672.9370 684.3827 730.5105 733.6781 788.0738 808.8304 859.8839 880.4674 887.9829 926.1456 929.0982 985.7741 988.8310 1009.6045 1036.0277 1051.9568 1073.0186 1090.9067 1096.2514 1150.4691 1173.1299 1185.8222 1217.7517 1231.6992 1273.1739 1282.6923 1287.7613 1313.5966 1342.8514 1383.8934 1392.4428 1394.6823 1438.6560 1471.8617 1475.5690 1477.7038 1485.3254 1490.1554 1535.9585 1572.2493 1581.8288 1611.2241 1616.8320 2929.6521 2974.4123 2976.4416 3032.4720 3050.6423 3072.4957 3080.5101 3139.3086 3152.8068 3167.1746 3182.0424 3551.0366
redmass: 3.6925 6.8115 6.0602 1.6529 4.4985 5.3626 4.9859 1.1616 4.2235 3.4918 3.0112 4.5763 6.0736 9.7038 8.1234 3.9198 2.1587 6.0489 1.8312 4.8851 5.2030 6.2465 5.4872 4.3365 4.9303 2.7692 1.4352 1.4432 2.2270 2.9088 2.1229 1.7587 1.8919 4.2351 4.4426 1.4048 1.3688 2.1313 3.0280 2.6834 2.0997 1.7717 2.4796 1.1244 1.4530 2.1179 1.6733 1.3773 1.5498 1.5174 2.1551 1.4959 2.6880 1.2171 10.0242 2.4281 1.1375 1.0979 1.0466 2.1963 1.1807 8.8795 8.8726 7.3635 8.3074 7.9849 1.0699 1.0424 1.0583 1.0922 1.0943 1.1000 1.0998 1.0864 1.0912 1.0971 1.0969 1.0649
irintensity: 0.8557 0.2071 0.5288 0.1532 2.1126 0.6260 0.8493 0.0566 2.0451 1.3310 1.1323 6.4975 6.9768 4.2839 4.4833 4.3482 65.9792 9.5134 39.9437 2.8918 3.8969 4.2912 6.4180 8.2670 20.3365 5.3182 1.1879 65.8848 2.2407 1.8292 13.8010 3.4567 0.5197 40.6208 23.4444 4.4545 0.0350 2.7557 7.6857 6.9878 13.2692 9.7270 66.3505 28.4648 96.1474 19.1769 39.0114 5.4897 16.4528 21.4017 37.5912 10.5345 45.7090 13.4896 3.0151 9.6074 1.5940 4.3706 19.6529 21.8512 38.0322 273.7144 17.7286 70.5741 51.1861 6.2772 39.0566 52.0011 14.8356 4.7314 1.9879 54.2011 38.3555 3.4699 5.1659 17.1931 7.9927 43.8047
temp: 298.150 k
press: 1.00000 atm
elementType: 8 8 8 6 6 6 6 6 6 6 6 6 6 6 6 6 1 1 1 1 1 1 1 1 1 1 1 1
symmnumber: 1
zpe: 569746.2 jmol-1
zpe.correction: 0.217005 hartree
zpe.thermalcorrener: 0.231401 hartree
zpe.thermalcorrenthalpy: 0.232345 hartree
zpe.thermalcorrgfe: 0.175003 hartree
zpe.sumelectzpe: -727.103691 hartree
zpe.sumelectthermal: -727.089295 hartree
zpe.sumelectthermalent: -727.088350 hartree
zpe.sumelectthermalfe: -727.145693 hartree
dipole: 0.4877 -6.2549 -0.0179
dipole: 6.2740
quadrupole: -74.9225 -106.7824 -94.2066
quadrupole: 2.9522 1.8243 1.2953
quadrupole: 17.0480 -14.8119 -2.2361 2.9522 1.8243 1.2953
hfenergy: -727.3206959 hartree
pointgroup: C01 [X(C13H12O3)]
dipole: -0.2900496 -2.4505319 -0.0599452 debye
polarizability: 220.6974678|17.11226|172.6456237|10.6778114|0.2113954|74.9850994 unknown
InChI: InChI=1S/C13H12O3/c1-2-5-10-11(14)8-6-3-4-7-9(8)12(15)13(10)16/h3-4,6-7,14H,2,5H2,1H3
charge 0 multiplicity 1
28 atoms
O  0.673001 -2.341081 0.353674
O  1.733884 2.370277 0.331586
O  -0.992126 2.942861 -0.016883
C  1.3024 0.010139 0.378205
C  2.777361 -0.291668 0.565204
C  -1.092739 -0.746682 0.072906
C  0.345191 -0.988217 0.275828
C  3.518869 -0.573747 -0.775109
C  -1.56512 0.59622 -0.029981
C  0.895525 1.417668 0.26761
C  -0.612777 1.742336 0.063087
C  -2.01251 -1.819231 -0.020432
C  5.014262 -0.882372 -0.556419
C  -2.944369 0.845635 -0.22259
C  -3.387364 -1.558158 -0.212519
C  -3.857013 -0.226491 -0.313734
H  3.245146 0.590066 1.038699
H  2.93861 -1.140985 1.267061
H  3.03385 -1.412862 -1.314533
H  3.411203 0.316433 -1.422481
H  -1.643449 -2.84487 0.058122
H  5.154259 -1.780718 0.075252
H  5.520868 -0.03717 -0.05513
H  5.529405 -1.062048 -1.517161
H  -3.274951 1.886859 -0.296813
H  -4.092574 -2.393078 -0.283446
H  -4.923699 -0.029594 -0.462277
H  1.646255 -2.458722 0.502274
