program: Gaussian 09
title: 000121803
version: EM64L-G09RevD.01
frameworkgroup: C1[X(C9H15ClO4)]
method: RPBEPBE
basis: SDD
operation: Freq
keyword: #p
keyword: freq=noraman
keyword: PBEPBE/SDD
title: #p freq=noraman PBEPBE/SDD
converged: YES YES NO NO
title: Mulliken charges:
elementType: Cl O O O O C C C C C C C C C H H H H H H H H H H H H H H H
charge: 0.009640 -0.261657 -0.260964 -0.203171 -0.204982 -0.378920 -0.349359 0.349271 0.317280 -0.694458 -0.224662 -0.222527 -0.672800 -0.672371 0.248582 0.242584 0.238153 0.224580 0.218801 0.228099 0.240851 0.232040 0.236191 0.213790 0.241075 0.226709 0.215725 0.233862 0.228640
chargesum: 0.00000
title: Mulliken charges with hydrogens summed into heavy atoms:
elementType: Cl O O O O C C C C C C C C C
charge: 0.009640 -0.261657 -0.260964 -0.203171 -0.204982 -0.378920 0.141806 0.349271 0.317280 -0.012924 0.244288 0.245704 0.008774 0.005856
polarizability: 1.30556756e+02 -6.02049471e-01 1.26973565e+02 3.59702262e+00 -3.51175565e+00 1.04802238e+02
1716.lowfreq: -10.4064 -8.2113 -1.6522 -0.0013 -0.0013 0.0003 19.1839 29.8651 53.1384
frequency: 18.5968 29.7586 53.0972 62.6881 81.5025 94.5485 111.2172 125.8236 140.7244 175.8036 193.1549 203.4791 221.2764 232.6647 260.0311 267.2618 291.7467 308.1730 332.7544 358.6335 378.3434 401.4764 509.1279 622.6181 689.2449 702.5435 763.0076 793.0695 796.7280 798.9926 799.7695 817.1029 869.9088 947.6377 951.1664 1019.1694 1022.6195 1065.6552 1092.3868 1106.3079 1112.6564 1115.1706 1133.3415 1135.1349 1176.5162 1199.5560 1249.4546 1249.4614 1301.8060 1326.0347 1354.5367 1356.1972 1393.5566 1401.3561 1402.0028 1460.1235 1462.5134 1464.1844 1472.1188 1473.7621 1474.5157 1484.2257 1485.5794 1485.8531 1631.3806 1650.2879 2995.3135 2996.3925 2996.6467 3012.5720 3013.3819 3020.8423 3072.5453 3073.2316 3079.5224 3091.3016 3093.0839 3093.4268 3107.4349 3108.3619 3110.1127
redmass: 4.1688 3.4379 5.0392 2.5257 2.3998 2.6973 4.4422 3.3681 1.8771 3.9394 1.9691 2.1825 2.7664 1.9727 1.7904 2.2064 2.4382 4.8429 5.2848 4.9551 3.8216 4.6419 4.6267 9.0133 4.5456 5.0174 5.9858 4.3826 1.4265 1.1130 1.2399 3.1348 5.8228 2.8951 2.1777 2.2792 2.3428 2.9159 2.7376 3.7079 2.2463 2.3277 1.4598 1.4683 5.6718 2.6604 1.1341 1.1391 1.3153 1.3410 1.3691 1.3768 1.1965 1.2611 1.2628 1.0761 1.0404 1.0400 1.0676 1.0634 1.0463 1.0546 1.0623 1.0646 11.8764 11.5817 1.0355 1.0359 1.0359 1.0584 1.0582 1.0618 1.1065 1.1064 1.1008 1.0989 1.0985 1.0986 1.1017 1.1029 1.1028
irintensity: 0.2481 0.9238 0.2892 0.6903 3.4937 0.2575 0.7000 0.6399 0.8720 0.5173 1.1360 1.1840 3.5170 1.3712 3.2956 5.0833 2.2279 7.7635 13.4537 4.0797 2.5148 2.8351 8.0103 23.6377 7.2848 3.4198 4.9931 11.6488 14.2179 5.5554 9.5963 3.8114 29.5483 39.2590 14.5173 77.2009 66.6585 9.1212 279.1121 133.3831 1.9837 22.0752 6.9641 7.9644 130.9737 134.5578 0.0784 0.2659 18.5925 3.2058 2.1815 0.9015 10.9271 25.2717 26.4011 19.2964 11.4741 13.5668 4.6069 5.2382 9.8820 6.8624 12.4159 17.5735 175.2672 151.2442 22.5366 18.6930 19.8179 17.3062 15.1130 8.3763 4.4200 4.8931 5.6739 30.8426 30.3027 23.6092 32.7692 37.7823 37.1047
temp: 298.150 k
press: 1.00000 atm
elementType: 17 8 8 8 8 6 6 6 6 6 6 6 6 6 1 1 1 1 1 1 1 1 1 1 1 1 1 1 1
symmnumber: 1
zpe: 604265.5 jmol-1
zpe.correction: 0.230153 hartree
zpe.thermalcorrener: 0.247532 hartree
zpe.thermalcorrenthalpy: 0.248476 hartree
zpe.thermalcorrgfe: 0.182895 hartree
zpe.sumelectzpe: -1111.793163 hartree
zpe.sumelectthermal: -1111.775784 hartree
zpe.sumelectthermalent: -1111.774840 hartree
zpe.sumelectthermalfe: -1111.840421 hartree
dipole: 1.3436 -3.9849 2.4909
dipole: 4.8877
quadrupole: -75.8460 -92.7776 -92.0715
quadrupole: 4.6745 -1.0140 1.9366
quadrupole: 11.0524 -5.8793 -5.1731 4.6745 -1.0140 1.9366
hfenergy: -1112.0233157 hartree
pointgroup: C01 [X(C9H15Cl1O4)]
dipole: 0.5686451 1.2532468 -1.3430547 debye
polarizability: 130.5572442|-0.49103|123.8580215|-3.7993298|-8.3854348|107.9172938 unknown
InChI: InChI=1S/C9H15ClO4/c1-4-9(10,7(11)13-5-2)8(12)14-6-3/h4-6H2,1-3H3
charge 0 multiplicity 1
29 atoms
Cl 0.385157 -2.469317 1.412724
O  -1.70827 0.583139 -0.055205
O  2.06001 0.187894 -0.106937
O  -2.399044 -1.560332 0.536398
O  0.650577 0.810522 1.637675
C  0.012594 -1.072982 0.156652
C  0.331677 -1.647156 -1.244422
C  -1.492816 -0.745308 0.278081
C  0.901477 0.086226 0.652801
C  0.039949 -0.681063 -2.41551
C  -3.134387 1.047717 -0.02205
C  3.045255 1.222139 0.349579
C  -3.119694 2.529259 -0.378019
C  4.243929 1.13212 -0.587605
H  1.397327 -1.93113 -1.249935
H  -0.264284 -2.57147 -1.355647
H  0.623012 0.250374 -2.320411
H  -1.02955 -0.415777 -2.479958
H  0.326145 -1.169229 -3.364152
H  -3.712519 0.43721 -0.739411
H  -3.525616 0.856105 0.992873
H  2.546116 2.207254 0.315007
H  3.305715 1.002866 1.400618
H  -4.150885 2.92661 -0.355752
H  -2.510584 3.098551 0.344119
H  -2.707078 2.69124 -1.388673
H  5.002765 1.879414 -0.29211
H  4.706737 0.131647 -0.541923
H  3.947787 1.333077 -1.631504
