program: Gaussian 09
title: 000121796
version: EM64L-G09RevD.01
frameworkgroup: C1[X(C11H13NO3)]
method: RPBEPBE
basis: SDD
operation: Freq
keyword: #p
keyword: freq=noraman
keyword: PBEPBE/SDD
title: #p freq=noraman PBEPBE/SDD
converged: YES YES NO NO
title: Mulliken charges:
elementType: O O O N C C C C C C C C C C C H H H H H H H H H H H H H
charge: -0.336525 -0.236007 -0.265946 -0.121792 0.214263 0.300285 -0.333241 -0.369704 0.166458 -0.264022 -0.201852 0.297111 -0.608605 -0.606896 -0.795740 0.243472 0.257369 0.232856 0.235207 0.272504 0.232594 0.222343 0.273132 0.210886 0.242337 0.246244 0.233640 0.259628
chargesum: 0.00000
title: Mulliken charges with hydrogens summed into heavy atoms:
elementType: O O O N C C C C C C C C C C C
charge: -0.336525 -0.236007 -0.265946 -0.121792 0.214263 0.300285 -0.089769 -0.112335 0.166458 -0.031165 0.033355 0.297111 0.118837 0.119460 -0.056228
polarizability: 1.88518678e+02 9.66203472e+00 1.39395298e+02 -1.11244760e+01 2.05473572e+00 8.54686053e+01
1716.lowfreq: -7.6356 -4.1421 -0.0003 -0.0002 0.0006 12.1437 31.3181 37.2574 60.1113
frequency: 31.2409 36.7211 60.0938 71.9513 91.0660 117.0803 139.6865 142.7493 173.2705 220.6228 226.6467 256.7681 265.5360 327.4017 353.0769 397.3249 424.1776 427.2348 478.4832 503.7250 576.4088 593.9297 602.8571 607.1922 662.9392 699.4496 726.2183 759.0786 783.4320 834.7772 875.5670 945.0437 954.2921 969.6097 989.7954 1022.6428 1034.0733 1058.3731 1065.5923 1095.4835 1105.3992 1123.4216 1147.9354 1175.0552 1202.3730 1250.6203 1261.1468 1275.6976 1366.5966 1369.1543 1382.5676 1421.3715 1429.5229 1435.7981 1450.7367 1463.3753 1465.0846 1469.1790 1478.4187 1483.0097 1497.3983 1561.9945 1595.4931 1611.4919 1696.5758 2970.3517 2976.8233 2987.7387 3049.7843 3054.1659 3074.6650 3125.2536 3125.9410 3137.3821 3148.9636 3151.7472 3166.4460 3176.8007
redmass: 3.2348 2.1247 3.3775 2.4389 2.2236 3.9067 1.2279 4.7170 1.0496 4.0760 5.0583 5.1073 3.2281 4.3350 3.5957 5.7571 3.2365 3.7679 4.1910 3.7036 4.7605 2.8359 5.3681 6.8695 9.0556 5.3406 4.5169 1.6466 2.6399 5.9837 1.4624 2.4237 1.3909 3.8020 1.3399 1.8226 2.7921 1.3923 2.0828 1.2307 2.3280 1.7543 1.3829 1.0877 3.0469 5.5906 2.9764 1.6810 2.2159 1.5109 8.8819 1.1585 1.7738 1.3436 1.1400 1.0580 1.0526 2.3124 1.0478 1.0787 1.1553 5.7930 8.0164 6.5657 9.1794 1.0373 1.0392 1.0377 1.1006 1.0998 1.0969 1.0978 1.0992 1.0857 1.0960 1.0901 1.0945 1.1000
irintensity: 1.1429 7.0297 4.5591 3.2073 1.2486 0.9003 0.4202 0.0524 0.3182 0.5218 0.9936 0.2652 12.2824 1.1454 22.6947 3.2311 3.6791 2.7789 1.8314 8.7090 11.4662 2.5168 11.5875 2.8891 13.6447 4.1360 12.4190 51.6816 48.0345 23.5053 1.7579 34.9250 2.2465 66.4133 0.4048 2.9935 4.0163 21.4629 33.7973 7.7075 540.5378 38.3362 3.0200 5.3063 104.4985 7.9217 127.9193 71.2969 84.9520 78.3368 13.9925 26.1962 19.7596 9.0375 36.9713 17.2860 21.6910 23.4641 9.5748 36.0412 31.1867 83.8716 131.7618 56.5366 384.2675 36.4860 100.1757 3.7734 45.4754 31.3217 10.4142 3.3906 13.4142 1.3164 6.6151 11.3837 19.0409 12.8947
temp: 298.150 k
press: 1.00000 atm
elementType: 8 8 8 7 6 6 6 6 6 6 6 6 6 6 6 1 1 1 1 1 1 1 1 1 1 1 1 1
symmnumber: 1
zpe: 577001.4 jmol-1
zpe.correction: 0.219768 hartree
zpe.thermalcorrener: 0.235252 hartree
zpe.thermalcorrenthalpy: 0.236196 hartree
zpe.thermalcorrgfe: 0.175849 hartree
zpe.sumelectzpe: -706.283377 hartree
zpe.sumelectthermal: -706.267893 hartree
zpe.sumelectthermalent: -706.266949 hartree
zpe.sumelectthermalfe: -706.327296 hartree
dipole: -1.1110 -0.1110 -1.5513
dipole: 1.9113
quadrupole: -65.2210 -80.1080 -94.7979
quadrupole: -2.7876 -2.7101 2.2545
quadrupole: 14.8213 -0.0657 -14.7556 -2.7876 -2.7101 2.2545
hfenergy: -706.5031455 hartree
pointgroup: C01 [X(C11H13N1O3)]
dipole: 0.4330934 -0.0645842 -0.6113221 debye
polarizability: 186.8205215|15.3843227|137.6806004|8.0308284|-13.3748512|88.88146 unknown
InChI: InChI=1S/C11H13NO3/c1-8(13)9-6-4-5-7-10(9)15-11(14)12(2)3/h4-7H,1-3H3
charge 0 multiplicity 1
28 atoms
O  -0.80162 0.968511 -0.508413
O  -0.660901 -1.805649 -0.168062
O  -1.348443 0.504099 1.744141
N  -2.945941 0.29517 0.02726
C  1.249959 -0.334765 0.083694
C  0.584226 0.87863 -0.283238
C  2.662874 -0.272243 0.257902
C  1.308222 2.069716 -0.501449
C  0.540311 -1.651064 0.208989
C  3.390187 0.913944 0.047435
C  2.708583 2.089824 -0.346434
C  -1.699088 0.536382 0.541452
C  -4.008413 -0.125812 0.954663
C  -3.213186 0.126298 -1.409652
C  1.304777 -2.843326 0.780897
H  3.203033 -1.177451 0.55083
H  0.750304 2.969256 -0.777665
H  4.476173 0.924164 0.185241
H  3.261394 3.020017 -0.516204
H  -3.663802 0.025894 1.988138
H  -4.246399 -1.19802 0.81183
H  -4.9231 0.47007 0.779061
H  -2.434374 0.627679 -1.997661
H  -4.197561 0.565727 -1.653963
H  -3.220052 -0.948707 -1.676602
H  1.733462 -2.608391 1.771853
H  2.135186 -3.148266 0.116757
H  0.605591 -3.687485 0.877403
