program: Gaussian 09
title: 000121785
version: EM64L-G09RevD.01
frameworkgroup: C1[X(C8H12O3)]
method: RPBEPBE
basis: SDD
operation: Freq
keyword: #pfreq=noraman
keyword: PBEPBE/SDD
title: #p freq=noraman PBEPBE/SDD
converged: YES YES NO NO
title: Mulliken charges:
elementType: O O O C C C C C C C C H H H H H H H H H H H H
charge: -0.165877 -0.255164 -0.235856 0.133999 -0.487016 -0.448177 -0.493444 0.105369 -0.733780 0.218466 -0.503216 0.213148 0.249858 0.222063 0.258371 0.242243 0.258146 0.268381 0.211995 0.219599 0.237005 0.242785 0.241100
chargesum: 0.00000
title: Mulliken charges with hydrogens summed into heavy atoms:
elementType: O O O C C C C C C C C
charge: -0.165877 -0.255164 -0.235856 0.133999 -0.024010 0.032258 0.006945 0.105369 -0.033805 0.218466 0.217674
polarizability: 1.04385081e+02 3.76853360e+00 9.04489429e+01 1.03772735e+00 -6.48021672e-01 7.95439966e+01
1716.lowfreq: -23.5190 -12.8955 -8.5225 -0.0006 0.0006 0.0006 36.0359 69.7526 93.4022
frequency: 35.6457 69.6653 93.3915 105.7080 161.0899 186.7208 195.2081 218.4981 253.5978 313.1407 323.9913 388.6488 450.6960 484.4070 575.3121 585.3736 601.5313 665.5585 737.4554 796.3398 804.9349 876.9787 894.6596 935.0168 954.0520 1019.4734 1034.2545 1053.4903 1054.4414 1111.7958 1116.2974 1141.0772 1149.4580 1188.6270 1190.7257 1215.1848 1240.0684 1272.6352 1308.2176 1319.1411 1389.3565 1421.1385 1426.0399 1452.5598 1457.6408 1462.3094 1470.0039 1474.0475 1478.0847 1605.7978 1663.6389 2987.6887 2994.5414 3003.3292 3005.4120 3028.0588 3063.3934 3082.0202 3087.0155 3097.0657 3107.6158 3119.6797 3152.3019
redmass: 5.6258 3.8713 1.6816 1.6336 2.3868 1.3687 2.7247 2.1212 3.4446 3.8121 2.3310 5.0927 4.5164 2.8096 3.4059 5.4042 2.6946 4.5776 5.0322 3.3598 1.8438 1.9339 2.3157 3.3321 2.3624 1.8122 2.1020 1.7933 1.9784 1.5431 2.0137 2.6880 1.6646 1.6088 2.6851 2.1654 1.5674 1.3992 1.3900 1.3880 1.1818 1.1846 1.0784 1.0503 1.0890 1.0511 1.0496 1.0569 1.0928 9.0359 12.1950 1.0650 1.0373 1.0631 1.0297 1.0617 1.0954 1.0997 1.1006 1.1049 1.1046 1.0992 1.1048
irintensity: 3.0351 5.8866 1.5173 0.3113 0.5441 0.8021 9.4073 3.6999 0.7142 16.5140 1.7905 2.5506 5.1177 2.3915 5.7805 4.7211 1.1669 4.2246 3.8881 21.6540 23.3741 3.3251 2.0310 17.8925 12.1931 12.2531 35.4560 5.6773 73.5159 77.2554 170.8738 46.2822 47.1467 10.4235 1.7620 29.5422 26.1809 8.1165 3.4719 1.9810 9.8614 19.7582 19.9346 14.0317 9.0598 10.2892 15.8848 24.2975 22.4720 215.9157 115.1218 12.0287 16.0054 43.3693 29.3496 29.6625 7.4917 10.4324 22.2816 31.3769 25.0157 8.5634 13.7978
temp: 298.150 k
press: 1.00000 atm
elementType: 8 8 8 6 6 6 6 6 6 6 6 1 1 1 1 1 1 1 1 1 1 1 1
symmnumber: 1
zpe: 491373.6 jmol-1
zpe.correction: 0.187154 hartree
zpe.thermalcorrener: 0.198984 hartree
zpe.thermalcorrenthalpy: 0.199928 hartree
zpe.thermalcorrgfe: 0.148920 hartree
zpe.sumelectzpe: -536.861384 hartree
zpe.sumelectthermal: -536.849554 hartree
zpe.sumelectthermalent: -536.848610 hartree
zpe.sumelectthermalfe: -536.899618 hartree
dipole: -0.2058 -0.9937 1.1553
dipole: 1.5377
quadrupole: -52.0280 -76.6224 -63.8134
quadrupole: 1.8498 -1.9177 2.8337
quadrupole: 12.1266 -12.4678 0.3412 1.8498 -1.9177 2.8337
hfenergy: -537.0485381 hartree
pointgroup: C01 [X(C8H12O3)]
dipole: 0.0215342 0.5568834 -0.2354172 debye
dipolederiv: -0.4217566 0.0288652 0.0838844 -0.1372527 -0.999969 -0.0024499 0.1263727 0.0046242 -0.3558614 -1.2090593 0.3991108 -0.1154586 0.5993373 -0.6135043 -0.0526875 -0.0709488 -0.0846349 -0.3792719 -0.6212007 -0.0696605 -0.1931073 0.1524825 -0.704402 -0.2124919 -0.1004732 -0.4089791 -0.5498629 -0.6323575 -0.2605047 0.0385028 -0.2929485 -0.1778591 0.0007429 0.0773806 0.0400885 -0.0948516 0.1028222 -0.0366241 0.0790351 0.0111 0.0538328 -0.022792 0.0098449 -0.0123167 0.0257789 0.0831626 0.0070596 0.0627161 -0.0382284 0.0580412 -0.021561 0.0191808 0.0034784 0.0387505 -0.2785334 0.1812195 0.2417472 0.0335771 -0.0807617 -0.0347075 0.2811782 -0.0714221 -0.0065822 0.841746 0.0317616 -0.408429 0.3259392 1.0873981 -0.0250447 -0.6125596 -0.0700688 0.3082983 0.0354205 0.0605955 0.0098398 0.0715505 -0.0155461 0.0097203 0.0100785 -0.0418801 0.0844549 1.4945376 -0.1935882 0.2831563 -0.6558062 0.9263404 0.3539558 0.2797938 0.6082906 0.5160004 0.6110842 -0.09925 0.0853715 -0.0528642 0.2643169 -0.0448554 0.1616573 -0.074681 0.2834188 -0.0374647 0.0368735 -0.1162695 0.0072149 0.0757568 -0.0208262 -0.086379 0.0168227 -0.0984178 0.0221378 -0.1150475 0.044443 -0.0694519 -0.0553284 0.034767 0.0397268 -0.0026737 0.070495 -0.0971106 0.1489486 0.0390049 0.116403 -0.0292245 -0.0131039 0.0166999 0.0013687 0.0755317 0.0664631 -0.0715698 -0.1006155 -0.0365597 0.0489294 -0.0126471 -0.0615978 -0.0249166 -0.0437795 -0.0227368 -0.0487313 -0.0572007 -0.0103876 0.045168 -0.0409782 -0.1024019 -0.0474357 0.0518893 0.1002079 -0.017762 -0.0009832 0.0096757 0.0164711 0.0707174 0.0589626 0.0696991 -0.05457 0.0780295 0.0622554 0.0217577 0.0882362 -0.0326109 -0.0321765 0.0208869 0.01456 0.0942721 -0.0974618 -0.0106269 -0.1344177 -0.0014908 0.1010833 -0.0063772 -0.0804555 -0.0111394 -0.0068669 0.0181786 -0.0901953 0.09232 -0.0958619 0.0022669 0.0740062 0.0633247 0.0403038 -0.0003327 0.0074929 0.0768642 0.0037787 0.1226419 -0.0185377 -0.0457565 0.031432 -0.0676088 0.0826426 -0.008653 0.0047258 0.0571824 -0.0136182 0.0967994 0.0091866 -0.0422033 0.0595625 -0.1083548 -0.0349486 -0.0247196 -0.0162583 -0.1336882 -0.0486606 0.0353593 -0.0395005 0.0589585 0.0672191 unknown
polarizability: 103.0548132|-5.4965368|90.2768193|-1.1789854|4.1219908|81.0463877 unknown
InChI: InChI=1S/C8H12O3/c1-8(7(10)11-2)5-3-4-6(8)9/h3-5H2,1-2H3
charge 0 multiplicity 1
23 atoms
O  -0.898553 -1.928217 -0.024779
O  2.085934 -0.508332 -0.187243
O  1.373676 1.376106 0.968196
C  -0.117025 0.344895 -0.738635
C  -0.944223 1.658585 -0.664665
C  -1.767589 1.566073 0.65194
C  -2.146732 0.071255 0.762213
C  -1.03939 -0.688431 0.021742
C  0.18613 -0.168576 -2.165257
C  1.165015 0.49277 0.100582
C  3.325187 -0.497127 0.627347
H  -1.62218 1.696957 -1.538981
H  -0.301279 2.553548 -0.686088
H  -2.651927 2.225271 0.63514
H  -1.131154 1.864938 1.501801
H  -3.102832 -0.149629 0.24522
H  -2.250744 -0.309501 1.793426
H  0.654331 -1.164061 -2.122282
H  -0.752229 -0.244313 -2.743447
H  0.866689 0.5204 -2.695752
H  3.903394 -1.358107 0.265053
H  3.077938 -0.603964 1.696803
H  3.873861 0.44746 0.474868
