program: Gaussian 09
title: 000121764
version: EM64L-G09RevD.01
frameworkgroup: C1[X(C9H12N4O3S)]
method: RPBEPBE
basis: SDD
operation: Freq
keyword: #p
keyword: freq=noraman
keyword: PBEPBE/SDD
title: #p freq=noraman PBEPBE/SDD
converged: YES YES NO NO
title: Mulliken charges:
elementType: S O O O N N N N C C C C C C C C C H H H H H H H H H H H H
charge: 0.320307 -0.328191 -0.215927 -0.221456 -0.040507 -0.315072 0.034637 0.089180 0.342609 -0.227012 -0.707123 -0.728749 -0.695896 0.191677 -0.157362 -0.074792 -0.217036 0.241307 0.232680 0.232579 0.221098 0.234647 0.232096 0.216697 0.228798 0.246766 0.205740 0.357009 0.301297
chargesum: 0.00000
title: Mulliken charges with hydrogens summed into heavy atoms:
elementType: S O O O N N N N C C C C C C C C C
charge: 0.320307 -0.328191 -0.215927 -0.221456 -0.040507 0.041936 0.034637 0.089180 0.342609 0.014295 -0.020766 -0.045309 -0.014592 0.191677 -0.157362 -0.074792 0.084260
polarizability: 2.94123346e+02 -3.36339447e+00 1.52343748e+02 3.97569614e+00 -6.20538736e+00 8.63881632e+01
1716.lowfreq: -20.0179 -4.6626 -0.6676 -0.0010 0.0012 0.0017 17.8524 28.9616 59.9332
frequency: 13.1528 28.9047 59.9170 68.4431 89.2132 102.2368 152.5608 166.9117 182.4118 201.6461 231.5687 246.2722 260.5251 264.3438 283.8352 292.5225 331.6116 378.5706 414.3592 440.4253 469.8993 483.8160 502.6188 564.4700 573.5964 593.8546 601.5383 653.4034 655.2630 672.5268 707.1695 713.0765 733.8327 766.3517 826.4885 853.6266 886.5356 926.5200 935.1685 937.0945 990.0589 1028.8528 1052.8416 1070.5847 1075.7337 1109.4244 1154.6523 1188.2589 1204.3948 1221.4609 1241.0347 1244.9764 1295.8557 1300.1629 1335.0686 1339.9217 1380.1194 1390.0861 1398.4352 1450.3725 1458.2245 1464.8104 1471.3649 1472.0147 1478.8308 1489.5129 1508.4338 1565.1471 1641.3045 2967.2656 2989.3839 2993.3141 2996.0785 3084.7331 3089.4732 3094.2249 3095.3969 3100.1917 3106.2943 3215.6696 3544.6085
redmass: 5.4589 5.8179 5.0793 5.3436 11.9985 7.1449 8.1324 1.3346 2.7374 3.9411 1.2545 1.2178 2.9233 2.8164 7.8195 2.3319 2.9081 7.2141 3.7439 4.1531 6.5695 4.1914 3.3751 8.0691 1.5296 4.5871 6.4776 4.3400 5.9782 11.1433 5.4654 4.9431 9.9313 3.6420 5.5565 5.5347 1.4297 1.5013 2.7489 2.5489 1.2719 1.6688 9.3580 2.1584 2.4611 2.3407 2.7626 3.8830 2.2829 4.5976 1.6897 3.1389 1.4388 6.6470 1.5231 13.5450 1.2742 1.2248 1.2039 1.0515 1.0488 1.0485 1.3353 2.6813 1.0587 1.0500 1.8539 7.7932 8.4046 1.0838 1.0359 1.0362 1.0367 1.0986 1.0989 1.0991 1.1006 1.1003 1.1000 1.0962 1.0765
irintensity: 0.0180 0.0474 0.0629 0.0752 0.0007 3.0638 3.5233 0.5051 0.9234 1.7514 0.2149 0.2167 0.4819 0.7517 5.0503 0.1587 0.9013 1.2507 8.9815 0.2570 3.1821 9.6068 5.4148 17.0807 56.4049 10.2682 1.3121 58.8252 0.6169 7.1697 35.6044 10.3541 2.9327 18.7826 64.1835 16.4807 15.3377 8.1382 88.7610 9.0763 0.6402 62.6555 5.4011 29.6023 175.5032 16.0766 31.6503 371.7946 139.0935 279.8164 13.7887 23.1597 52.9147 52.8486 5.5414 128.8776 27.7023 22.5062 26.2783 2.6936 3.7734 12.6859 69.1797 159.6373 4.7816 20.2994 137.4097 1144.4889 287.1535 29.6184 18.1166 6.0652 37.7838 9.4936 5.8650 47.1963 15.7077 38.4033 21.6400 4.6167 91.3163
temp: 298.150 k
press: 1.00000 atm
elementType: 16 8 8 8 7 7 7 7 6 6 6 6 6 6 6 6 6 1 1 1 1 1 1 1 1 1 1 1 1
symmnumber: 1
zpe: 559642.1 jmol-1
zpe.correction: 0.213156 hartree
zpe.thermalcorrener: 0.230283 hartree
zpe.thermalcorrenthalpy: 0.231227 hartree
zpe.thermalcorrgfe: 0.166275 hartree
zpe.sumelectzpe: -1191.505456 hartree
zpe.sumelectthermal: -1191.488330 hartree
zpe.sumelectthermalent: -1191.487386 hartree
zpe.sumelectthermalfe: -1191.552337 hartree
dipole: -8.8520 -1.7762 0.1184
dipole: 9.0292
quadrupole: -125.2183 -107.3319 -105.2020
quadrupole: 0.2783 -0.8787 -0.3060
quadrupole: -12.6343 5.2522 7.3821 0.2783 -0.8787 -0.3060
hfenergy: -1191.7186124 hartree
pointgroup: C01 [X(C9H12N4O3S1)]
dipole: -3.4943748 0.6234364 -0.1410289 debye
polarizability: 294.0089724|6.1738495|151.5186985|-0.9174499|-10.2007398|87.3275858 unknown
InChI: InChI=1S/C9H12N4O3S/c1-5-9(2,3)16-7(11-5)12-8-10-4-6(17-8)13(14)15/h4-5,12H,1-3H3
charge 0 multiplicity 1
29 atoms
S  2.491182 1.457554 -0.224452
O  -2.521663 1.265447 0.04129
O  5.516857 -1.141915 0.214583
O  5.464876 1.119769 -0.210969
N  -1.783165 -0.961983 0.159211
N  -0.2395 0.929676 -0.07064
N  1.280405 -0.927146 0.252275
N  4.889809 -0.024138 0.014688
C  -3.809246 0.432604 -0.064227
C  -3.281633 -1.009214 0.333142
C  -4.275492 0.569545 -1.520881
C  -4.804853 1.012767 0.942517
C  -3.886598 -2.192862 -0.433474
C  -1.48706 0.29781 0.050276
C  1.009315 0.355302 0.013788
C  3.457855 -0.051583 0.045037
C  2.643859 -1.157974 0.270554
H  -3.470658 -1.160413 1.416485
H  -4.456128 1.632417 -1.756445
H  -3.516584 0.181393 -2.222428
H  -5.21547 0.013783 -1.685511
H  -4.379174 1.009819 1.960586
H  -5.078403 2.049319 0.680355
H  -5.728665 0.405322 0.949546
H  -3.696454 -2.117277 -1.517114
H  -3.423734 -3.12776 -0.075421
H  -4.97714 -2.260094 -0.265327
H  -0.302866 1.937587 -0.233156
H  3.024929 -2.162553 0.455312
