program: Gaussian 09
title: 000121752
version: EM64L-G09RevD.01
frameworkgroup: C1[X(C9H20O3)]
method: RPBEPBE
basis: SDD
operation: Freq
keyword: #pfreq=noraman
keyword: PBEPBE/SDD
title: #p freq=noraman PBEPBE/SDD
converged: YES YES NO NO
title: Mulliken charges:
elementType: O O O C C C C C C C C C H H H H H H H H H H H H H H H H H H H H
charge: -0.296390 -0.275796 -0.466797 0.041621 -0.276076 -0.247842 -0.066727 -0.716849 -0.209985 -0.384687 -0.706252 -0.682130 0.196485 0.200874 0.178872 0.213588 0.184190 0.200819 0.232936 0.211273 0.222480 0.173916 0.182838 0.212869 0.213400 0.199565 0.264058 0.217474 0.207890 0.223951 0.209202 0.341231
chargesum: 0.00000
title: Mulliken charges with hydrogens summed into heavy atoms:
elementType: O O O C C C C C C C C C
charge: -0.296390 -0.275796 -0.125566 0.238106 0.103670 0.149936 0.134092 -0.050160 0.146769 0.041582 -0.025155 -0.041087
polarizability: 1.27214860e+02 1.88848678e+00 1.17623943e+02 -1.71154756e+00 -6.40224799e-01 8.87709142e+01
1716.lowfreq: -11.5636 -5.6146 -0.0008 -0.0007 -0.0007 6.4482 16.1935 24.4765 42.2362
frequency: 14.8165 24.3757 42.1738 55.8542 85.1576 97.9351 118.9475 144.1958 168.5315 201.8191 224.7908 227.3850 240.0890 256.8982 261.8696 314.5578 317.4416 382.2539 390.4268 433.1180 464.7135 515.3336 537.6527 764.6028 801.0622 837.5351 886.7229 890.7311 895.6999 918.7933 922.1299 931.9791 943.4959 1021.6746 1054.1330 1062.8989 1065.3354 1076.3544 1090.8576 1103.5634 1129.3168 1130.7610 1145.3574 1162.0990 1201.9382 1223.1802 1228.5184 1246.2843 1277.6691 1288.3673 1305.3774 1307.3723 1325.4462 1353.5057 1361.4198 1382.0092 1384.1675 1390.3058 1399.8793 1408.4248 1456.4438 1463.3334 1466.2150 1473.5269 1474.8918 1477.9263 1480.6751 1482.5255 1483.1477 1492.5304 2902.6164 2927.1218 2947.3607 2950.4012 2953.9158 2965.8459 2973.5218 2975.9700 2982.0443 2985.4608 2999.1212 3016.7119 3046.9651 3068.4804 3076.4100 3078.6164 3079.0193 3087.5675 3088.2445 3572.0925
redmass: 3.0531 3.7751 3.0220 1.8295 3.1575 3.1602 2.7284 3.0453 3.0818 1.4736 1.1263 1.5183 1.3800 1.3385 1.6029 2.8986 3.2540 2.7915 3.2243 2.3443 3.3353 3.5698 2.9291 1.0775 3.4141 2.6401 1.4415 1.3764 1.9661 1.4799 1.9781 1.8737 2.2903 3.8186 2.9867 5.7853 1.6661 2.2716 2.3868 2.1818 2.0960 1.7256 1.5375 1.8939 1.2464 1.2244 1.2235 1.2427 1.1048 1.2968 1.1938 1.3526 1.2421 1.3683 1.4090 1.2389 1.2737 1.2376 1.5773 1.5139 1.0828 1.0565 1.0615 1.0644 1.0540 1.0661 1.0418 1.0772 1.0708 1.0858 1.0551 1.0558 1.0594 1.1049 1.0838 1.0804 1.0377 1.0358 1.0418 1.0974 1.0601 1.1061 1.1012 1.0994 1.1022 1.0990 1.0990 1.1001 1.0992 1.0662
irintensity: 1.7137 0.5714 2.4417 0.3462 1.3234 1.1858 3.5076 7.2273 8.6786 0.1831 0.1543 5.1941 2.3645 128.6896 21.9805 1.6316 8.0343 4.1688 5.1647 3.9349 0.7052 11.7498 1.7157 6.7048 5.7727 6.3476 3.6132 4.6845 20.0941 5.8619 1.8840 28.7812 0.5709 146.7951 13.0472 147.9584 94.4360 16.9638 38.1857 6.3888 14.2122 6.1559 3.6506 20.5885 17.0961 2.7943 7.6388 10.6519 0.0998 3.8747 13.4694 1.5851 4.4873 13.2217 7.3002 4.6360 53.2171 9.8576 8.8824 6.7568 5.6241 1.4356 20.3613 6.9362 2.0939 11.6527 12.5258 1.3031 8.1353 12.1761 59.7715 82.9213 27.2703 54.3569 26.8798 58.9969 25.4290 42.5790 19.3261 65.8154 27.6467 58.6618 1.1710 41.7349 81.9932 47.0086 44.4519 32.3287 17.1071 3.7601
temp: 298.150 k
press: 1.00000 atm
elementType: 8 8 8 6 6 6 6 6 6 6 6 6 1 1 1 1 1 1 1 1 1 1 1 1 1 1 1 1 1 1 1 1
symmnumber: 1
zpe: 734913.9 jmol-1
zpe.correction: 0.279914 hartree
zpe.thermalcorrener: 0.296230 hartree
zpe.thermalcorrenthalpy: 0.297174 hartree
zpe.thermalcorrgfe: 0.233604 hartree
zpe.sumelectzpe: -579.562810 hartree
zpe.sumelectthermal: -579.546494 hartree
zpe.sumelectthermalent: -579.545550 hartree
zpe.sumelectthermalfe: -579.609120 hartree
dipole: -1.8445 0.1876 0.5110
dipole: 1.9231
quadrupole: -77.9203 -65.2342 -76.3318
quadrupole: -3.8482 -0.0085 -2.2591
quadrupole: -4.7582 7.9279 -3.1697 -3.8482 -0.0085 -2.2591
hfenergy: -579.8427236 hartree
pointgroup: C01 [X(C9H20O3)]
dipole: 0.7294549 0.0438305 -0.1960885 debye
polarizability: 127.0511661|-2.2910929|117.7918603|-1.4637869|0.9666865|88.7666904 unknown
InChI: InChI=1S/C9H20O3/c1-4-5-11-7-9(3)12-6-8(2)10/h8-10H,4-7H2,1-3H3
charge 0 multiplicity 1
32 atoms
O  -1.253498 0.732558 -0.520513
O  1.566228 0.393869 0.308886
O  -4.144636 -1.434292 0.065988
C  -0.468545 1.706399 0.258677
C  0.96456 1.600207 -0.264364
C  -2.487605 0.275603 0.126752
C  -2.781239 -1.12721 -0.42269
C  -1.043848 3.12907 0.116842
C  2.871933 0.076457 -0.280488
C  3.402447 -1.187047 0.404892
C  -1.747444 -2.163887 0.04013
C  4.774311 -1.61946 -0.157293
H  -0.467126 1.398649 1.327613
H  0.942579 1.541427 -1.374586
H  1.551755 2.497739 0.033557
H  -3.337482 0.948143 -0.107096
H  -2.363004 0.22635 1.230062
H  -2.78221 -1.067937 -1.532158
H  -2.098668 3.156256 0.442563
H  -0.477815 3.848493 0.737647
H  -1.00375 3.462566 -0.935978
H  3.577658 0.926961 -0.131974
H  2.762649 -0.08751 -1.377193
H  3.475334 -0.995757 1.492037
H  2.660107 -1.996649 0.272061
H  -1.905141 -3.143208 -0.451488
H  -0.731994 -1.806019 -0.206555
H  -1.812277 -2.306348 1.134865
H  5.53491 -0.828289 -0.015992
H  5.139073 -2.530022 0.350588
H  4.713486 -1.839355 -1.239924
H  -4.351246 -2.378656 -0.148069
