program: Gaussian 09
title: 000121734
version: EM64L-G09RevD.01
frameworkgroup: C1[X(C11H17NO2)]
method: RPBEPBE
basis: SDD
operation: Freq
keyword: #p
keyword: freq=noraman
keyword: PBEPBE/SDD
title: #p freq=noraman PBEPBE/SDD
converged: YES YES NO NO
title: Mulliken charges:
elementType: O O N C C C C C C C C C C C H H H H H H H H H H H H H H H H H
charge: -0.380153 -0.263347 -0.132829 -0.360777 -0.434420 -0.335937 -0.360017 0.230929 -0.168387 -0.691992 0.002544 -0.781156 -0.322802 0.140198 0.204741 0.221723 0.227219 0.235964 0.191321 0.190327 0.200390 0.202647 0.232327 0.221982 0.210644 0.211697 0.215270 0.251653 0.255505 0.247670 0.337066
chargesum: 0.00000
title: Mulliken charges with hydrogens summed into heavy atoms:
elementType: O O N C C C C C C C C C C C
charge: -0.043086 -0.263347 -0.132829 0.065686 0.028763 0.045711 0.043019 0.230929 0.063940 -0.047669 0.002544 -0.058728 -0.075131 0.140198
polarizability: 1.87765443e+02 6.99430160e+00 1.31823490e+02 1.87830003e+01 6.21403165e-01 9.04629998e+01
1716.lowfreq: -10.8787 0.0008 0.0008 0.0009 3.9135 12.6826 32.2526 36.3993 58.3187
frequency: 31.7454 36.1913 58.1872 92.1771 99.8328 108.7441 125.7299 157.6758 174.0532 229.0887 249.0757 266.7411 305.0002 322.4729 336.6002 350.0434 392.7415 433.2513 471.2880 505.0711 518.9130 553.9572 566.8431 644.8651 729.2093 730.7573 759.2182 770.7754 814.4939 840.7341 854.1591 895.6451 928.4266 956.1062 986.4541 1004.8717 1034.5154 1039.7639 1048.8729 1074.6214 1105.5473 1116.5074 1156.0471 1200.1282 1203.8244 1208.5617 1243.6378 1249.8706 1262.6194 1285.5754 1291.2646 1313.8355 1339.1116 1352.4582 1358.5551 1391.0016 1391.4247 1406.6561 1456.9002 1465.3714 1467.1204 1469.3719 1476.6624 1477.8127 1485.1321 1490.7123 1507.4340 1546.3087 1563.8562 1634.3526 2953.7906 2971.1668 2974.1661 2975.0603 2979.8032 2995.2861 3011.8239 3022.6501 3040.0801 3056.2515 3070.0414 3073.6030 3076.1070 3079.9362 3150.1002 3184.3327 3572.8408
redmass: 4.0046 5.0239 1.5892 2.6790 2.0422 3.1989 1.7047 1.8059 3.3023 1.1179 1.7390 2.3208 5.2043 6.7896 3.1870 2.7969 2.2319 3.4798 6.5214 4.7395 4.4689 3.6781 3.8394 5.9648 3.0866 1.0885 1.1411 4.9486 1.8284 1.2249 2.4572 1.8588 1.2862 1.3376 2.2543 3.4558 1.4787 2.1736 1.9953 2.4040 2.3679 2.4534 1.5266 3.7345 1.6774 1.5804 1.7217 1.6727 1.4051 1.0774 1.1619 1.3230 2.1449 1.5211 1.4282 1.6339 1.3238 1.2409 1.6007 1.4993 1.0768 1.1812 1.0948 1.0694 1.1154 1.1092 1.0994 6.3327 6.5340 6.5299 1.0587 1.0595 1.0365 1.0395 1.0599 1.0984 1.0638 1.1007 1.1022 1.0968 1.1010 1.0995 1.0992 1.0998 1.0888 1.0974 1.0651
irintensity: 1.5622 4.3081 0.2966 4.2413 2.7752 1.0502 0.0003 0.1736 0.2429 0.0100 62.8872 47.8138 0.8141 9.1019 3.4355 9.4911 4.4416 3.8767 3.7960 4.2908 5.0395 7.0486 14.3271 4.4105 3.2024 10.3088 0.1286 9.2283 49.7337 1.1947 3.3964 3.2832 0.3943 12.3400 70.2843 4.7713 3.7669 3.8362 8.6733 0.6813 87.6750 9.3142 26.9265 40.8080 61.1583 64.0656 40.0873 73.6625 7.8712 0.0159 4.4669 0.5812 16.7350 5.3844 11.7690 32.7669 2.1987 7.7991 12.1240 12.5649 1.0053 4.0557 18.3174 3.4961 8.2077 39.1721 3.3524 69.3699 96.6855 277.9810 14.2257 28.3693 36.4685 28.1980 40.4730 2.8437 47.0791 5.1510 33.3317 19.5100 57.9491 50.3850 46.7743 28.2478 6.8272 5.7925 16.6463
temp: 298.150 k
press: 1.00000 atm
elementType: 8 8 7 6 6 6 6 6 6 6 6 6 6 6 1 1 1 1 1 1 1 1 1 1 1 1 1 1 1 1 1
symmnumber: 1
zpe: 685481.8 jmol-1
zpe.correction: 0.261086 hartree
zpe.thermalcorrener: 0.276615 hartree
zpe.thermalcorrenthalpy: 0.277559 hartree
zpe.thermalcorrgfe: 0.217243 hartree
zpe.sumelectzpe: -633.463725 hartree
zpe.sumelectthermal: -633.448196 hartree
zpe.sumelectthermalent: -633.447252 hartree
zpe.sumelectthermalfe: -633.507568 hartree
dipole: 9.1969 2.6043 2.7336
dipole: 9.9418
quadrupole: -122.1295 -73.5692 -87.3022
quadrupole: -9.1364 -7.6934 -1.1833
quadrupole: -27.7958 20.7644 7.0314 -9.1364 -7.6934 -1.1833
hfenergy: -633.7248111 hartree
pointgroup: C01 [X(C11H17N1O2)]
dipole: -3.6403742 -0.9206791 1.094986 debye
polarizability: 188.2171994|5.3096743|131.5086507|-18.3750245|-2.2753572|90.3260825 unknown
InChI: InChI=1S/C11H17NO2/c1-3-4-5-7-12-8-6-10(13)11(14)9(12)2/h6,8,14H,3-5,7H2,1-2H3
charge 0 multiplicity 1
31 atoms
O  3.283855 -1.73547 -0.373697
O  4.219428 0.829714 -0.732974
N  0.300228 0.272066 0.621135
C  -2.105602 0.172965 -0.172223
C  -1.125019 0.151816 1.023955
C  -3.578671 0.074975 0.283513
C  -4.57597 0.114223 -0.897902
C  1.094133 -0.857934 0.3208
C  0.826676 1.546526 0.456328
C  -6.047251 0.017567 -0.44086
C  2.412236 -0.67321 -0.098179
C  0.477299 -2.232984 0.495433
C  2.114107 1.763881 0.012688
C  3.023032 0.665616 -0.314863
H  -1.871472 -0.661166 -0.863422
H  -1.951377 1.106905 -0.747884
H  -1.353455 0.996629 1.700255
H  -1.26368 -0.769908 1.614435
H  -3.808857 0.90797 0.98062
H  -3.731783 -0.863023 0.857647
H  -4.347403 -0.71656 -1.595772
H  -4.42447 1.0516 -1.470124
H  0.15131 2.369374 0.709051
H  -6.739574 0.047538 -1.301665
H  -6.232112 -0.9250 0.108209
H  -6.309912 0.855065 0.232624
H  1.040031 -2.998254 -0.068646
H  -0.552909 -2.275141 0.102212
H  0.451482 -2.553962 1.554754
H  2.492395 2.783863 -0.095298
H  2.891704 -2.606979 -0.11725
