program: Gaussian 09
title: 000121848
version: EM64L-G09RevD.01
frameworkgroup: C1[X(C20H24N2O2)]
method: RPBEPBE
basis: SDD
operation: Freq
keyword: #p
keyword: freq=noraman
keyword: PBEPBE/SDD
title: #p freq=noraman PBEPBE/SDD
converged: YES YES NO NO
title: Mulliken charges:
elementType: O O N N C C C C C C C C C C C C C C C C C C C C H H H H H H H H H H H H H H H H H H H H H H H H
charge: -0.248593 -0.428059 -0.341183 0.052296 0.278689 -0.402537 -0.129673 -0.696927 -0.695866 -0.722852 0.218456 0.232459 -0.275672 0.225905 0.244648 -0.332566 -0.399365 -0.409569 -0.426718 -0.403508 -0.234333 -0.231096 -0.233514 -0.241831 0.244981 0.192553 0.233612 0.222865 0.223769 0.212727 0.207650 0.231078 0.203925 0.210737 0.202977 0.209788 0.234685 0.192262 0.257036 0.246043 0.246857 0.274147 0.310318 0.328929 0.226552 0.227068 0.228823 0.232024
chargesum: 0.00000
title: Mulliken charges with hydrogens summed into heavy atoms:
elementType: O O N N C C C C C C C C C C C C C C C C C C C C
charge: -0.248593 -0.099129 -0.096202 0.052296 0.278689 0.023629 0.093192 -0.052782 -0.050125 -0.075402 0.218456 0.232459 0.173626 0.225905 0.244648 -0.332566 -0.153321 -0.162712 -0.152571 -0.093190 -0.007781 -0.004028 -0.004691 -0.009806
polarizability: 3.38787479e+02 -9.66829407e+00 3.00824819e+02 -1.66208110e+01 -1.23446260e+01 1.39568995e+02
1716.lowfreq: -7.0794 -0.6082 -0.0008 -0.0004 0.0004 4.7363 9.2190 16.1034 17.5625
frequency: 6.9918 15.7797 17.4068 43.2455 54.4340 75.9114 102.6621 108.6738 126.5128 135.7079 145.7043 168.8230 183.1892 203.6363 222.3086 243.4916 245.0729 255.4274 261.3113 279.6220 307.9999 309.6910 329.9935 335.4759 372.3838 408.7681 413.5368 432.4326 434.5459 443.9570 456.4475 472.1371 490.2033 509.4768 535.1780 570.3473 588.2452 615.9474 649.7560 659.9824 664.0701 725.3078 743.3230 749.2431 761.2642 771.8214 800.7298 804.6971 848.3140 868.8073 887.2561 889.8284 899.7686 904.0164 918.5256 926.9634 939.1195 944.1309 958.4080 965.8945 988.8887 993.2390 996.9278 1002.8098 1009.6074 1017.6119 1019.8877 1031.0843 1037.7841 1079.6131 1087.5226 1098.0180 1106.5233 1116.6709 1158.5224 1161.2397 1169.4530 1175.8785 1182.2240 1211.8700 1223.1188 1238.8046 1241.1829 1265.8859 1271.2073 1298.5875 1302.1648 1308.9834 1350.2072 1356.9024 1369.5726 1372.1710 1379.1647 1382.2848 1395.1326 1402.3351 1439.0647 1444.4032 1449.4630 1458.0750 1461.5703 1463.8824 1464.4379 1470.3826 1476.3560 1477.5840 1482.3821 1489.3888 1495.3146 1565.5981 1589.0095 1594.3550 1614.5470 1620.8989 2918.8072 2961.1053 2968.1520 2973.0739 2982.5538 3014.5482 3046.4657 3062.9094 3067.8304 3069.4820 3073.9904 3075.8820 3088.4975 3094.8067 3125.2238 3126.4430 3138.1661 3140.7781 3153.2760 3158.4195 3167.1184 3189.8501 3415.7349 3548.4461
redmass: 3.1122 4.4814 4.5311 4.9315 4.1854 3.5697 4.1693 2.8797 4.2106 3.7709 5.1858 1.6502 2.4022 2.1345 2.3684 3.5146 1.2723 1.0813 1.1581 4.5163 2.9335 4.9036 2.4768 4.6477 2.9369 3.4491 5.8260 2.2626 3.7729 2.5898 2.9028 3.4269 2.8033 5.2796 3.6511 3.2882 6.6948 7.0265 4.1335 1.5100 6.4928 5.6782 3.2383 1.5627 1.4591 6.1441 2.6078 2.4131 3.1213 3.7082 2.3312 1.4348 1.5890 1.9651 1.9081 1.6863 1.2091 4.9530 1.4297 1.4199 1.3439 6.3361 1.3417 3.5359 1.7968 1.4614 2.2548 1.7387 1.8979 2.6415 2.5703 3.2613 1.6418 2.5642 1.7221 1.1893 1.0836 1.2405 1.3717 2.5761 2.2771 2.8732 2.2269 1.5647 1.8889 1.7883 1.2337 1.7547 1.3547 1.3621 1.2032 1.2570 8.5246 1.2946 1.2081 2.9174 2.2347 3.0811 1.0994 1.1043 1.0501 1.0538 2.8236 1.0774 4.0820 1.0591 1.0784 1.1117 1.0661 9.7619 6.8590 6.9163 7.3849 7.6126 1.0672 1.0649 1.0351 1.0367 1.0361 1.0899 1.0864 1.0987 1.0995 1.0983 1.0979 1.0978 1.1007 1.0998 1.0857 1.0856 1.0905 1.0915 1.0949 1.0977 1.0997 1.0959 1.0737 1.0660
irintensity: 0.0658 0.3717 0.1202 0.8068 0.6171 1.8129 5.9120 1.7642 1.1338 0.3293 0.1429 2.1734 14.4724 2.7405 12.4118 8.9318 22.5612 30.5533 99.5582 7.7823 24.6648 0.0431 1.2928 0.7021 20.4455 1.5150 0.7140 12.0919 5.1150 3.8687 0.5821 0.0413 8.4493 0.2183 17.8731 0.0936 17.0681 2.5988 10.7551 101.4923 5.7238 4.6443 1.7236 127.0309 2.7280 35.0328 14.6061 32.9058 24.7238 53.3876 38.5474 0.5406 0.3243 27.8579 40.6356 40.8773 0.4938 188.2104 3.0158 6.0231 0.0663 3.6888 0.4099 88.1765 30.4391 7.2630 2.7490 97.6852 4.6152 19.0632 2.8283 5.3415 3.2967 26.7599 5.8337 39.7813 0.2682 2.1513 16.5277 70.3122 3.5683 40.7934 1.4992 13.7495 22.2151 1.8445 7.8649 6.4972 9.2638 19.2088 25.6802 22.6963 5.3825 16.0646 21.2974 1.0299 40.3662 23.5102 13.5759 8.3078 0.9380 2.1358 1.0583 18.9846 3.4114 9.6434 4.1876 8.9915 21.8395 13.4924 7.1196 1.3590 17.4276 8.5297 60.4992 70.7830 31.4732 38.8743 12.0784 14.7207 27.7355 2.5014 9.4574 57.1421 13.8439 84.4101 2.7104 80.0804 3.2337 0.0864 9.7423 14.2858 24.9638 37.7516 27.5077 5.9250 1.8494 5.2605
temp: 298.150 k
press: 1.00000 atm
elementType: 8 8 7 7 6 6 6 6 6 6 6 6 6 6 6 6 6 6 6 6 6 6 6 6 1 1 1 1 1 1 1 1 1 1 1 1 1 1 1 1 1 1 1 1 1 1 1 1
symmnumber: 1
zpe: 1038509.7 jmol-1
zpe.correction: 0.395547 hartree
zpe.thermalcorrener: 0.419138 hartree
zpe.thermalcorrenthalpy: 0.420082 hartree
zpe.thermalcorrgfe: 0.339326 hartree
zpe.sumelectzpe: -1034.663236 hartree
zpe.sumelectthermal: -1034.639645 hartree
zpe.sumelectthermalent: -1034.638701 hartree
zpe.sumelectthermalfe: -1034.719457 hartree
dipole: 2.0936 0.7753 -0.3038
dipole: 2.2531
quadrupole: -113.0967 -139.1597 -141.9109
quadrupole: 2.9236 -2.6838 -1.6196
quadrupole: 18.2924 -7.7706 -10.5218 2.9236 -2.6838 -1.6196
hfenergy: -1035.0587831 hartree
pointgroup: C01 [X(C20H24N2O2)]
dipole: -0.8090202 0.3450844 0.1102669 debye
polarizability: 339.162702|7.2446152|300.9986821|-18.5933358|4.5712651|139.0199095 unknown
InChI: InChI=1S/C20H24N2O2/c1-20(2,3)21-12-14(23)13-24-22-19-17-10-6-4-8-15(17)16-9-5-7-11-18(16)19/h4-11,14,21,23H,12-13H2,1-3H3
charge 0 multiplicity 1
48 atoms
O  -0.649368 -0.628553 0.363573
O  -2.725458 -2.513991 1.234772
N  -4.775159 0.123399 -0.525338
N  0.23169 0.523527 0.352068
C  -6.025471 0.939945 -0.373639
C  -4.449211 -0.877707 0.512495
C  -2.971408 -1.330779 0.389744
C  -7.299455 0.058581 -0.207361
C  -5.875886 1.88623 0.844247
C  -6.144351 1.786952 -1.664178
C  3.806901 0.531598 -0.159932
C  3.552558 -0.92454 -0.222147
C  -2.01709 -0.175154 0.692367
C  2.559287 1.194469 0.065885
C  2.146583 -1.155007 -0.037693
C  1.489692 0.163632 0.146034
C  4.994477 1.279058 -0.280453
C  4.432114 -2.005505 -0.41437
C  2.487728 2.595164 0.171528
C  1.623492 -2.465712 -0.041304
C  4.924998 2.690639 -0.173323
C  3.904423 -3.32166 -0.419913
C  3.685504 3.342279 0.050294
C  2.518627 -3.548252 -0.234101
H  -4.741373 -0.300467 -1.464566
H  -4.604486 -0.418772 1.508569
H  -5.071061 -1.801336 0.48041
H  -2.776462 -1.702113 -0.632903
H  -7.2294 -0.579844 0.692497
H  -8.203742 0.686852 -0.103993
H  -7.439195 -0.599574 -1.08611
H  -4.9434 2.470991 0.756455
H  -5.852378 1.332003 1.800611
H  -6.730393 2.585228 0.890405
H  -6.236305 1.13853 -2.557699
H  -7.037926 2.434876 -1.625837
H  -5.249908 2.422295 -1.78946
H  -2.05498 0.109837 1.765273
H  -2.28289 0.699456 0.073907
H  5.957501 0.786283 -0.454222
H  5.506086 -1.841474 -0.555853
H  1.527356 3.090783 0.342698
H  0.555017 -2.636655 0.104579
H  -2.668617 -2.227448 2.182416
H  5.839616 3.287186 -0.264886
H  4.576515 -4.174494 -0.568328
H  3.655713 4.434613 0.129167
H  2.132496 -4.573468 -0.239687
