program: Gaussian 09
title: 000121737
version: EM64L-G09RevD.01
frameworkgroup: C1[X(C6H4ClFO4S2)]
method: RPBEPBE
basis: SDD
operation: Freq
keyword: #p
keyword: freq=noraman
keyword: PBEPBE/SDD
title: #p freq=noraman PBEPBE/SDD
converged: NO NO NO NO
title: Mulliken charges:
elementType: Cl S S F O O O O C C C C C C H H H H
charge: -0.167528 0.899743 1.104628 -0.330660 -0.441128 -0.441204 -0.460282 -0.460218 -0.086054 -0.088976 -0.186445 -0.186084 -0.188871 -0.189228 0.306202 0.306181 0.304938 0.304985
chargesum: 0.00000
title: Mulliken charges with hydrogens summed into heavy atoms:
elementType: Cl S S F O O O O C C C C C C
charge: -0.167528 0.899743 1.104628 -0.330660 -0.441128 -0.441204 -0.460282 -0.460218 -0.086054 -0.088976 0.119757 0.120097 0.116067 0.115757
polarizability: 1.94448472e+02 5.77871954e-01 1.29109186e+02 -7.38213602e+00 1.50538480e+00 1.08346007e+02
1716.lowfreq: -7.2601 -4.1484 -0.0027 -0.0004 0.0015 9.5708 20.6981 39.4080 42.3157
frequency: 20.6718 39.3438 42.2977 88.5405 96.5941 140.4683 156.8925 178.9637 187.7057 229.8936 233.1053 267.1443 299.6794 314.2255 332.4738 381.4603 398.1924 404.9554 427.8000 463.5548 509.4399 561.8540 600.2242 685.1340 698.2320 824.8898 838.9555 844.5096 855.6030 963.0998 963.5447 971.6803 988.0547 998.9604 1039.5266 1042.4036 1110.7651 1176.8809 1284.2335 1371.7550 1405.8292 1442.0458 1553.8367 1603.7133 3163.9657 3164.5907 3177.7844 3180.3129
redmass: 18.5735 4.5113 16.4709 15.6909 11.9723 13.5724 10.5277 15.5714 13.8986 12.7764 17.6415 11.5360 10.3963 12.7508 11.3853 6.0512 15.9602 2.8547 15.5676 12.4123 4.1665 14.3455 7.0751 7.6792 4.1961 17.2916 1.2374 1.4264 14.0614 7.8783 18.4312 1.3180 1.4018 15.0663 4.1579 2.2714 1.3421 1.1312 1.2277 3.6587 6.3166 1.9979 5.9154 8.2463 1.0899 1.0891 1.0976 1.0988
irintensity: 0.0521 0.0872 4.0127 2.8034 10.2238 1.0075 0.0007 1.1496 0.0353 2.3865 6.7513 23.1843 29.7238 3.6572 14.1085 0.5549 16.5484 0.0127 25.2977 149.8048 73.7174 160.2757 0.0032 7.6490 0.7854 71.7911 1.2737 67.3102 79.1808 6.9312 55.5723 0.7608 1.3571 64.9357 4.5592 25.0350 1.9086 0.7439 0.0012 46.3107 2.7129 12.3321 1.8058 0.0597 17.5952 0.2008 14.7433 0.0584
temp: 298.150 k
press: 1.00000 atm
elementType: 17 16 16 9 8 8 8 8 6 6 6 6 6 6 1 1 1 1
symmnumber: 1
zpe: 249575.6 jmol-1
zpe.correction: 0.095058 hartree
zpe.thermalcorrener: 0.110043 hartree
zpe.thermalcorrenthalpy: 0.110987 hartree
zpe.thermalcorrgfe: 0.050271 hartree
zpe.sumelectzpe: -1886.579518 hartree
zpe.sumelectthermal: -1886.564534 hartree
zpe.sumelectthermalent: -1886.563590 hartree
zpe.sumelectthermalfe: -1886.624306 hartree
dipole: -0.0857 0.0821 -1.0629
dipole: 1.0695
quadrupole: -142.9568 -99.5758 -110.1592
quadrupole: 0.2734 -3.5224 0.8092
quadrupole: -25.3929 17.9882 7.4047 0.2734 -3.5224 0.8092
hfenergy: -1886.6745768 hartree
pointgroup: C01 [X(C6H4Cl1F1O4S2)]
dipole: 0.0597468 -0.0016188 0.4165236 debye
dipolederiv: -0.3782158 -0.0001788 0.0675322 -0.0005559 -0.2065658 0.0010306 0.2454114 0.0014574 -0.7355249 1.7582642 0.0000025 -0.1304394 -0.0000644 0.9492439 -0.0020144 -0.1675933 -0.0020934 1.6425519 2.1157218 -0.0003594 -0.0344393 -0.0006731 1.1911258 -0.0024148 0.0526733 -0.002342 1.5759754 -0.5438165 0.0002611 -0.0209216 0.0017386 -0.310996 0.0038576 -0.2311887 0.0038117 -0.8503945 -0.6186662 -0.0008453 0.0236346 0.0261288 -0.4533934 0.1372247 -0.0304112 0.0435925 -0.4701128 -0.61882 0.0009112 0.0235633 -0.025466 -0.4528796 -0.1368892 -0.0304895 -0.0435383 -0.4711397 -0.6768291 -0.0139392 0.0226964 -0.082645 -0.5096041 0.0696357 0.0392787 0.0283175 -0.4087199 -0.6768712 0.013956 0.0226536 0.0824751 -0.5082361 -0.0713042 0.0403117 -0.0298326 -0.4101674 0.2028741 0.0001478 -0.0846601 0.0005567 0.0332743 0.0007284 -0.0986635 0.0011401 -0.1433662 0.0428422 -0.0001094 0.0181071 -0.0011122 0.0002792 0.0006013 0.1683568 0.0002623 -0.1301686 -0.2804354 0.2094101 0.0542912 -0.2531675 -0.0506558 0.0161305 0.0330104 0.0207482 -0.0650772 -0.2799891 -0.2093483 0.0522934 0.2524733 -0.0504357 -0.0158688 0.035265 -0.0211274 -0.0652205 -0.2047263 -0.2178909 -0.0016051 0.2756225 -0.0398454 -0.0221457 -0.0372943 0.0045985 -0.0479856 -0.2050025 0.2181413 0.0006282 -0.2753551 -0.0400394 0.0221597 -0.0402743 -0.0041445 -0.0478938 0.0971073 -0.0478759 -0.0157169 -0.0114881 0.1141375 0.0071206 0.0164943 -0.0116609 0.1499978 0.0970393 0.0478443 -0.0152056 0.011428 0.1139682 -0.0073987 0.0167424 0.011372 0.1498671 0.0847425 0.045725 0.009058 0.0016658 0.110309 0.0020068 -0.0058534 -0.0084349 0.1636278 0.0847807 -0.0458523 0.0085299 -0.0015615 0.1103134 -0.00246 -0.0057759 0.0078738 0.163751 unknown
polarizability: 193.1962273|0.0010881|129.2161077|-12.6970733|0.1898963|109.4913306 unknown
InChI: InChI=1S/C6H4FO4S2.Cl/c7-13(10,11)6-3-1-5(2-4-6)12(8)9;/h1-4H;
charge 0 multiplicity 1
18 atoms
Cl 3.652662 0.002853 -2.192473
S  3.233689 -0.002129 0.179901
S  -3.243639 0.000942 0.103312
F  -3.443114 0.014407 -1.736576
O  3.735093 -1.420863 0.77134
O  3.736932 1.412689 0.779156
O  -3.802574 -1.414904 0.611595
O  -3.801445 1.409742 0.631954
C  1.341953 -0.000955 0.127449
C  -1.361059 0.000198 0.103293
C  0.698655 1.246421 0.130163
C  0.697673 -1.247789 0.117839
C  -0.714892 1.246411 0.119309
C  -0.715861 -1.246622 0.106846
H  1.268946 2.179648 0.15165
H  1.267229 -2.181629 0.130189
H  -1.283622 2.180999 0.129783
H  -1.285326 -2.180822 0.107872
