program: Gaussian 09
title: 000121736
version: EM64L-G09RevD.01
frameworkgroup: C1[X(C11H11N3O3)]
method: RPBEPBE
basis: SDD
operation: Freq
keyword: #p
keyword: freq=noraman
keyword: PBEPBE/SDD
title: #p freq=noraman PBEPBE/SDD
converged: YES YES NO NO
title: Mulliken charges:
elementType: O O O N N N C C C C C C C C C C C H H H H H H H H H H H
charge: -0.244298 -0.214109 -0.219560 -0.274966 -0.135648 0.020047 0.443127 0.461185 0.190355 -0.518615 -0.654471 -0.776513 -0.334973 -0.352328 -0.362456 -0.365001 0.388472 0.282985 0.272693 0.251662 0.247512 0.256815 0.246432 0.247226 0.299559 0.269709 0.288052 0.287108
chargesum: 0.00000
title: Mulliken charges with hydrogens summed into heavy atoms:
elementType: O O O N N N C C C C C C C C C C C
charge: -0.244298 -0.214109 -0.219560 -0.274966 -0.135648 0.020047 0.443127 0.461185 0.190355 -0.235630 0.117395 -0.026040 -0.035413 -0.082619 -0.074404 -0.077893 0.388472
polarizability: 2.78085439e+02 -3.13514229e+00 1.59935135e+02 3.92058803e+00 8.90817555e+00 8.08564380e+01
1716.lowfreq: -6.3387 -0.0003 0.0002 0.0005 2.3545 4.3412 45.0073 53.2419 72.7862
frequency: 44.9928 53.2398 72.7827 90.7193 131.6572 147.6133 153.0499 171.9026 196.8029 213.8695 233.9436 282.1852 310.1089 321.5160 353.1044 410.9119 421.8977 478.2313 498.9758 509.6856 569.6626 594.4643 598.2839 625.4365 628.1599 666.7248 688.2490 703.2782 731.4830 788.4901 805.7070 830.0662 839.4931 859.5439 966.6599 981.5742 988.4032 992.1089 1002.3199 1023.8098 1047.6931 1090.8255 1096.0361 1116.9818 1129.6453 1168.9330 1178.7690 1196.2584 1212.4668 1224.7312 1297.1623 1328.9752 1355.2170 1374.2091 1402.0082 1406.9137 1431.4656 1439.2423 1457.9906 1469.8632 1479.4180 1486.8694 1496.0940 1584.6930 1599.9558 1606.3798 1654.5671 2978.7033 2985.1770 3064.1475 3089.6865 3112.6793 3129.0416 3159.8981 3180.2540 3184.2614 3202.8716 3248.5515
redmass: 5.4715 9.1170 5.3590 4.8437 1.7290 2.9738 2.0302 1.6380 1.9650 5.4314 8.3601 2.7126 4.7807 4.3555 5.9087 4.6669 3.5161 5.0226 4.3189 6.2429 4.5578 6.1442 4.0635 6.4941 5.6400 4.9040 4.2101 6.2137 5.0739 8.6310 1.4266 2.2675 1.6700 1.6092 5.7425 1.3214 1.3849 1.7242 2.5646 2.5096 1.5368 2.2716 3.1029 1.2992 1.6281 1.7467 1.4538 6.5186 2.1543 4.7282 1.3081 4.2073 8.0548 3.3684 4.7426 1.4310 3.0925 1.2989 1.0611 1.0658 1.1127 2.6816 1.0955 8.1113 6.7815 6.3346 10.7203 1.0427 1.0395 1.0969 1.0914 1.0976 1.1013 1.0891 1.0903 1.0958 1.0966 1.0992
irintensity: 0.5750 1.9955 2.0658 2.6845 1.6129 2.2902 1.6820 0.0801 0.5288 5.6674 4.8708 2.1337 2.3459 5.1233 0.3899 2.4554 8.1864 16.6820 2.7650 1.8126 6.2338 0.8115 10.6235 1.4515 16.4104 20.2206 1.4228 33.0913 5.0961 9.9080 49.5256 3.2861 13.6759 64.8168 42.6916 5.3104 3.1432 0.8840 5.9153 72.6496 11.0646 51.2323 12.9048 25.8460 90.5971 9.9944 196.0953 57.9939 45.9885 416.3559 4.8856 220.3642 106.8396 60.1428 31.5642 27.4880 18.1980 37.4837 30.9019 13.9799 14.4144 96.8383 6.5678 7.2142 16.0810 226.4377 370.3301 49.2379 19.7448 12.6688 11.3370 11.7356 7.7173 3.4153 0.9602 3.1437 1.2363 0.5291
temp: 298.150 k
press: 1.00000 atm
elementType: 8 8 8 7 7 7 6 6 6 6 6 6 6 6 6 6 6 1 1 1 1 1 1 1 1 1 1 1
symmnumber: 1
zpe: 548187.2 jmol-1
zpe.correction: 0.208793 hartree
zpe.thermalcorrener: 0.224049 hartree
zpe.thermalcorrenthalpy: 0.224993 hartree
zpe.thermalcorrgfe: 0.165909 hartree
zpe.sumelectzpe: -814.369227 hartree
zpe.sumelectthermal: -814.353971 hartree
zpe.sumelectthermalent: -814.353027 hartree
zpe.sumelectthermalfe: -814.412112 hartree
dipole: -8.6917 -4.9183 1.4632
dipole: 10.0934
quadrupole: -111.9878 -102.2850 -97.6349
quadrupole: 14.4068 0.0112 0.4536
quadrupole: -8.0185 1.6842 6.3343 14.4068 0.0112 0.4536
hfenergy: -814.5780206 hartree
pointgroup: C01 [X(C11H11N3O3)]
dipole: -3.378943 -2.0043864 0.5783436 debye
polarizability: 278.101817|-0.4476224|160.0845459|5.1685594|7.9101792|80.6906495 unknown
InChI: InChI=1S/C11H11N3O3/c1-8-7-11(15)13(12(8)2)9-3-5-10(6-4-9)14(16)17/h3-7H,1-2H3
charge 0 multiplicity 1
28 atoms
O  -1.747103 2.602063 -0.299381
O  4.907015 0.824131 0.331122
O  4.715888 -1.298826 -0.488767
N  -1.469655 0.254203 0.167409
N  -2.312368 -0.903184 0.090876
N  4.204296 -0.189491 -0.059154
C  -3.601377 -0.437622 -0.251901
C  -0.061668 0.128912 0.100579
C  -2.24012 1.443894 -0.212431
C  -3.576592 0.925735 -0.474937
C  -2.138003 -1.918692 1.15934
C  -4.761656 -1.388817 -0.312792
C  0.747124 1.218417 0.533783
C  0.547811 -1.053156 -0.410386
C  2.145575 1.115081 0.47246
C  1.94637 -1.159795 -0.46034
C  2.734367 -0.076219 -0.011004
H  -4.403276 1.546528 -0.809023
H  -1.089124 -2.247526 1.20055
H  -2.764373 -2.790061 0.913159
H  -2.42878 -1.520959 2.151283
H  -5.635367 -0.877239 -0.745364
H  -5.052296 -1.754966 0.690104
H  -4.53146 -2.268742 -0.94047
H  0.268733 2.13026 0.894776
H  -0.077785 -1.855987 -0.811139
H  2.788941 1.935429 0.800435
H  2.438282 -2.052271 -0.855587
