program: Gaussian 09
title: 000121840
version: EM64L-G09RevD.01
frameworkgroup: C1[X(C20H33NO3S)]
method: RPBEPBE
basis: SDD
operation: Freq
keyword: #p
keyword: freq=noraman
keyword: PBEPBE/SDD
title: #p freq=noraman PBEPBE/SDD
converged: YES YES NO NO
title: Mulliken charges:
elementType: S O O O N C C C C C C C C C C C C C C C C C C C C H H H H H H H H H H H H H H H H H H H H H H H H H H H H H H H H H
charge: 0.110341 -0.406087 -0.227725 -0.302589 -0.366203 -0.500054 -0.523019 -0.466449 0.394904 -0.308238 0.459516 -0.446310 -0.210049 -0.817960 -0.755750 -0.155070 -0.824894 -0.641988 -0.341038 0.385928 0.187921 -0.802902 -0.819001 0.302271 -0.778600 0.204183 0.207811 0.216312 0.194638 0.212475 0.202947 0.236880 0.200230 0.200098 0.221189 0.213635 0.213205 0.243998 0.269015 0.255141 0.300700 0.282176 0.279593 0.226766 0.223896 0.230032 0.211144 0.323886 0.210156 0.251574 0.215409 0.261981 0.208691 0.214557 0.252801 0.268416 0.214197 0.385314
chargesum: 0.00000
title: Mulliken charges with hydrogens summed into heavy atoms:
elementType: S O O O N C C C C C C C C C C C C C C C C C C C C
charge: 0.110341 -0.020773 -0.227725 -0.302589 -0.042317 -0.088060 -0.112068 -0.051028 0.394904 -0.071358 0.459516 -0.045981 0.011140 -0.147123 -0.231594 0.145630 -0.144200 -0.080220 -0.129893 0.385928 0.187921 -0.125764 -0.133772 0.302271 -0.043187
polarizability: 3.13158505e+02 -3.80598070e+00 2.36390408e+02 -1.24191810e+00 -3.10765895e+00 2.17300627e+02
1716.lowfreq: -14.0222 -6.3553 -0.0009 0.0009 0.0010 5.7830 10.8846 13.0619 24.7274
frequency: -9.2456 10.1086 24.3538 25.9877 39.0475 46.5680 49.0585 51.7499 59.2893 65.3128 71.3049 80.2338 84.4726 88.4221 92.9500 96.6898 109.2711 123.6381 135.4255 159.3574 161.7023 170.8272 188.4370 196.5074 215.6174 233.2845 236.0199 286.4276 306.7742 311.9645 326.7132 330.3020 340.8054 358.9976 378.1604 398.2682 403.1981 416.2031 452.7336 460.8597 477.9635 494.4566 507.3282 519.5001 521.4834 551.8810 570.5095 578.2662 594.3476 602.3851 615.6366 628.9083 656.1834 712.9442 728.7690 745.3653 779.1142 789.1699 800.1131 841.8140 852.7244 860.2625 890.4873 902.1583 914.7835 935.0992 949.1903 952.3072 961.8306 982.5579 983.7467 985.3474 1000.0897 1004.3241 1008.9847 1023.4297 1038.4276 1046.1137 1051.3178 1063.2310 1071.0107 1079.2545 1089.9120 1116.1268 1123.5088 1127.5858 1146.5320 1152.6829 1158.5221 1196.8483 1197.8081 1213.5858 1219.4694 1230.2138 1230.6377 1239.2386 1257.5105 1260.3455 1275.8389 1297.2679 1299.6649 1310.5437 1321.6207 1323.4291 1328.9136 1355.6045 1370.7958 1376.7388 1385.9126 1387.4736 1393.9311 1395.3995 1396.0323 1432.5010 1444.9533 1449.3474 1452.7727 1455.0973 1458.0992 1463.2379 1463.9686 1466.5195 1468.9034 1472.0763 1473.5348 1476.7385 1479.5485 1482.1070 1483.2665 1487.4279 1609.3879 1659.0875 1675.3458 1692.2408 1693.0094 2935.2382 2956.3259 2959.5208 2961.8801 2963.6381 2964.7904 2969.4099 2974.8819 2979.5687 2982.2005 2996.3410 3023.6603 3030.7620 3030.8678 3031.2753 3033.6523 3034.3329 3037.1841 3037.9910 3047.2391 3059.7099 3072.6681 3081.8260 3087.2165 3087.7095 3092.9006 3093.4195 3096.2498 3108.5141 3109.9147 3111.9075 3515.8675 3561.1219
redmass: 4.8178 5.3606 4.1679 5.5456 5.3946 3.4215 3.6526 4.3777 3.4022 2.9071 2.9927 2.2419 1.9578 1.4691 2.3856 2.6784 2.8155 4.2749 3.1964 1.2744 1.2294 1.9305 2.8777 5.6094 1.1994 3.0649 3.0831 2.6990 2.4658 2.2874 3.2336 2.4318 4.0267 4.1862 2.6115 2.3663 2.5253 2.5227 3.2844 2.4735 2.3092 2.5095 3.7738 2.6063 2.5915 2.1865 1.6546 2.8533 3.1149 3.0029 4.4113 2.6670 2.2972 4.2192 2.0717 1.6331 2.4037 2.0595 2.9128 1.5121 1.3954 1.6472 1.7854 1.9198 2.0990 1.9558 4.3007 1.4200 1.8218 1.9354 1.7912 1.7957 1.2759 1.9619 2.0470 1.4989 1.5565 1.6480 2.6086 1.7119 1.8462 2.1008 1.6604 2.4234 1.9263 2.2266 1.6726 1.4178 1.3032 1.3296 1.4926 1.4925 1.3191 1.9021 1.3696 1.5660 1.7385 1.5322 1.1106 1.3106 1.3026 1.6883 2.0083 1.3847 1.4890 1.4431 1.3284 1.4507 1.3205 1.2369 1.2931 1.2271 1.3215 1.0889 1.1122 1.0634 1.0712 1.0551 1.0730 1.0937 1.1060 1.1056 1.0592 1.0846 1.0581 1.0719 1.0723 1.4287 1.2564 1.0830 5.7361 9.3244 6.5392 6.4384 6.4153 1.0590 1.0363 1.0404 1.0506 1.0545 1.0603 1.0404 1.0904 1.0802 1.0625 1.0361 1.0605 1.0649 1.0963 1.0926 1.0967 1.0953 1.0961 1.0963 1.0970 1.0918 1.0980 1.0972 1.0945 1.0918 1.0989 1.0960 1.0896 1.0998 1.1050 1.1044 1.0640 1.0781
irintensity: 3.9485 0.1629 0.7428 0.7337 0.4111 1.0523 1.1468 1.6985 2.7313 1.4628 2.6646 0.2558 0.8680 0.8288 8.0926 7.4912 3.5770 1.0542 1.0887 0.5451 1.2413 0.2938 2.4938 6.0451 2.9934 0.8874 3.3557 0.0388 1.0853 1.6221 7.1740 0.9330 1.9763 4.0407 3.5609 0.5324 10.3695 2.7802 3.3537 8.2808 6.4221 11.7183 25.9927 6.1720 3.4593 8.9105 189.5973 6.2499 36.6439 3.3117 8.5163 105.2312 44.2884 19.8026 1.5955 1.0964 1.2995 7.8326 8.3364 21.1885 15.2806 24.2059 6.7375 10.1850 18.4095 9.9371 28.0305 2.7747 3.1319 3.9468 15.7591 3.3307 3.5911 18.2708 36.8087 5.4636 1.4277 16.8554 6.1996 4.8923 140.1415 25.1029 7.4563 1.0226 15.1816 18.2098 2.2642 0.8671 9.9938 9.7881 25.3923 5.3932 22.2580 0.2633 2.8371 7.3741 47.9703 8.5928 0.6575 0.8671 6.5874 63.7117 29.3476 0.9733 0.0242 3.2086 0.6585 0.5647 5.1682 87.0034 8.1185 34.3459 29.6300 12.6260 11.6210 27.7005 5.2733 3.7982 6.3551 5.2521 47.9711 27.0873 13.7031 7.2772 16.4805 24.0415 13.1420 130.3796 91.5871 6.9663 159.1343 213.2671 17.0463 5.2517 5.1865 22.3601 41.9144 31.4026 25.7930 44.5363 30.8960 29.7826 27.8893 34.8052 101.9257 8.0245 25.9566 13.6787 12.1819 15.0250 11.4670 22.4609 24.6884 31.4390 38.6623 28.5434 50.1269 42.8286 29.4601 5.0965 10.6318 27.4040 34.0043 11.6996 5.3971 24.2782 33.9148 24.5020
temp: 298.150 k
press: 1.00000 atm
elementType: 16 8 8 8 7 6 6 6 6 6 6 6 6 6 6 6 6 6 6 6 6 6 6 6 6 1 1 1 1 1 1 1 1 1 1 1 1 1 1 1 1 1 1 1 1 1 1 1 1 1 1 1 1 1 1 1 1 1
symmnumber: 1
zpe: 1287830.9 jmol-1
zpe.correction: 0.490509 hartree
zpe.thermalcorrener: 0.521196 hartree
zpe.thermalcorrenthalpy: 0.522140 hartree
zpe.thermalcorrgfe: 0.424945 hartree
zpe.sumelectzpe: -1458.416663 hartree
zpe.sumelectthermal: -1458.385976 hartree
zpe.sumelectthermalent: -1458.385032 hartree
zpe.sumelectthermalfe: -1458.482227 hartree
dipole: -2.7102 0.6652 2.4067
dipole: 3.6851
quadrupole: -159.3732 -163.8512 -156.5159
quadrupole: 0.7170 10.2429 6.3745
quadrupole: 0.5402 -3.9377 3.3975 0.7170 10.2429 6.3745
hfenergy: -1458.9071718 hartree
pointgroup: C01 [X(C20H33N1O3S1)]
dipole: 1.0245308 -0.3027805 0.980114 debye
polarizability: 312.0667493|-9.3987349|237.5729928|3.7413477|2.0323017|217.2097975 unknown
InChI: InChI=1S/C20H33NO3S/c1-15(2)8-6-9-16(3)10-7-11-17(4)12-13-25-14-19(20(23)24)21-18(5)22/h8,10,12,19,21,23H,6-7,9,11,13-14H2,1-5H3
charge 0 multiplicity 1
58 atoms
S  0.590812 -2.436627 0.54259
O  -2.999797 -3.653229 0.949187
O  -2.256711 -4.157553 -1.1925
O  -3.907738 0.246113 -0.277299
N  -2.325166 -1.05779 0.815139
C  4.511878 1.384715 0.002935
C  4.694399 0.167273 -0.973805
C  0.723786 2.199865 0.933723
C  2.157572 1.680007 1.032358
C  3.083519 1.887264 0.052176
C  4.091168 -1.131064 -0.451574
C  0.35209 3.033046 -0.319947
C  2.897734 -1.58057 -0.944838
C  2.421646 0.888967 2.303168
C  2.147677 -2.811025 -0.532471
C  -2.020455 -1.843613 -0.377322
C  4.895289 -1.83271 0.627767
C  -0.540961 -1.73631 -0.81265
C  -1.077393 3.533868 -0.257821
C  -2.116123 3.226794 -1.089553
C  -2.418652 -3.324413 -0.276535
C  -3.504688 3.799649 -0.850993
C  -2.027548 2.29536 -2.285814
C  -3.276622 -0.047115 0.786583
C  -3.482213 0.706136 2.092111
H  4.881901 1.108375 1.007295
H  5.17225 2.198491 -0.359258
H  4.239214 0.432252 -1.947066
H  5.781595 0.028038 -1.147891
H  0.03442 1.329234 0.997022
H  0.506304 2.805822 1.840523
H  2.777088 2.458616 -0.835737
H  1.043745 3.899043 -0.385706
H  0.51993 2.427878 -1.230075
H  2.41385 -0.975976 -1.725899
H  2.095539 1.4593 3.195285
H  3.483529 0.626082 2.438664
H  1.842702 -0.056322 2.287517
H  1.760471 -3.377086 -1.397499
H  2.735712 -3.495924 0.097891
H  -2.646194 -1.404356 -1.183054
H  -0.283103 -0.681541 -0.997533
H  -0.382778 -2.3411 -1.721261
H  5.099117 -1.145872 1.472064
H  4.395813 -2.723661 1.041155
H  5.881592 -2.146848 0.232832
H  -1.28554 4.221554 0.578994
H  -1.888804 -1.324475 1.69896
H  -3.860858 4.364143 -1.736001
H  -4.229123 2.97905 -0.679987
H  -3.526659 4.479443 0.019574
H  -2.739184 1.457204 -2.154707
H  -1.017795 1.878954 -2.4399
H  -2.319682 2.826499 -3.213662
H  -4.561097 0.760639 2.312959
H  -3.115295 1.739804 1.961048
H  -2.959276 0.248924 2.949551
H  -3.233484 -4.621224 0.947588
