program: Gaussian 09
title: 000121720
version: EM64L-G09RevD.01
frameworkgroup: C1[X(C8H17O5P)]
method: RPBEPBE
basis: SDD
operation: Freq
keyword: #p
keyword: freq=noraman
keyword: PBEPBE/SDD
title: #p freq=noraman PBEPBE/SDD
converged: YES YES NO NO
title: Mulliken charges:
elementType: P O O O O O C C C C C C C C H H H H H H H H H H H H H H H H H
charge: 1.197456 -0.502964 -0.527289 -0.253360 -0.618981 -0.100821 -0.112465 -0.270066 -0.221400 -0.216437 -0.216947 -0.656749 -0.651878 -0.670653 0.254492 0.242250 0.224077 0.237294 0.215266 0.239415 0.196091 0.197869 0.208169 0.234882 0.227471 0.210103 0.230812 0.230686 0.205662 0.234115 0.233897
chargesum: 0.00000
title: Mulliken charges with hydrogens summed into heavy atoms:
elementType: P O O O O O C C C C C C C C
charge: 1.197456 -0.502964 -0.527289 -0.253360 -0.618981 -0.100821 -0.112465 0.226677 0.239970 0.238245 0.177014 0.013773 0.019723 0.003021
polarizability: 1.64610137e+02 2.12711658e+00 1.28186953e+02 3.28870781e+00 7.60371332e+00 1.13796330e+02
1716.lowfreq: -4.4692 -0.0005 -0.0002 0.0009 4.7924 6.4349 15.4206 23.0557 34.6316
frequency: 13.3412 22.6381 33.8889 43.2959 51.3964 55.9281 64.0078 75.6334 95.3118 127.6294 137.2234 152.0724 173.1075 193.6087 232.3704 233.6779 239.1708 275.9403 278.1157 292.1590 295.8313 367.8158 394.2963 453.4271 468.6732 492.4531 615.9162 669.3829 732.5264 806.8089 807.2276 817.5481 858.7575 867.4382 869.9321 931.7280 951.9408 1011.3045 1018.5229 1025.5808 1034.3638 1087.8805 1101.2616 1104.5094 1117.6354 1131.9492 1133.4558 1135.5690 1184.8077 1255.5365 1256.2339 1257.9025 1325.5244 1356.9210 1359.7764 1385.0035 1393.8974 1395.4113 1399.0466 1418.6918 1456.3394 1458.2100 1459.0419 1476.6248 1477.0351 1478.3987 1489.0430 1490.5733 1491.7231 1677.9537 2896.3894 2929.5992 2932.0531 2984.0238 2988.1461 2992.3878 2994.7060 2998.5877 2999.4586 3051.6819 3061.8824 3089.6758 3090.6330 3096.5358 3107.4084 3108.5564 3109.6858
redmass: 3.8659 2.5427 2.1560 1.9604 3.2151 2.3419 3.2464 4.6931 4.8834 4.1352 2.8093 5.7688 5.0049 4.7440 1.3206 1.1504 1.2040 6.7596 3.2229 4.3891 5.3336 4.5947 4.9168 4.1264 3.4606 9.0807 6.2299 6.0681 6.2483 1.0928 1.0933 1.0890 3.2897 4.4016 3.7379 2.0266 4.2896 2.5865 2.6469 3.9183 5.5472 6.6876 2.2003 2.2334 2.1514 1.4463 1.4357 1.4193 1.0856 1.1454 1.1370 1.1381 1.3030 1.2517 1.2378 1.2943 1.2447 1.2461 1.2605 1.1629 1.0401 1.0402 1.0399 1.0522 1.0531 1.0480 1.0814 1.0758 1.0841 10.6473 1.0561 1.0974 1.0551 1.1075 1.0535 1.0370 1.0394 1.0361 1.0561 1.1079 1.1080 1.0977 1.0981 1.0991 1.1012 1.1021 1.1024
irintensity: 2.3075 0.1442 1.8213 4.7413 1.7072 3.3679 0.7126 0.1751 2.5209 5.3700 13.6068 3.9259 18.6950 3.0230 0.7840 0.6639 0.1623 14.3109 5.9747 6.2061 7.0142 8.5977 9.7122 1.2690 6.7196 59.9772 108.4399 113.0737 7.4534 2.8859 3.0827 5.5222 74.8868 177.4432 116.6776 10.6760 90.3369 144.6885 152.7309 17.3534 71.1538 119.5856 5.6726 15.7530 16.4153 4.5071 6.1015 8.4494 0.0347 0.1722 0.0709 1.0557 12.9001 7.7796 4.0421 14.8632 23.5316 28.5751 35.7636 19.2744 11.3637 12.7587 11.7753 7.1044 9.0102 3.3114 19.2721 6.9733 1.4172 121.7022 52.8134 16.3540 63.1956 50.8211 30.7992 21.3756 26.3662 20.7625 23.4792 12.4706 9.2788 26.0132 30.3231 30.5129 31.8657 34.7948 38.4342
temp: 298.150 k
press: 1.00000 atm
elementType: 15 8 8 8 8 8 6 6 6 6 6 6 6 6 1 1 1 1 1 1 1 1 1 1 1 1 1 1 1 1 1
symmnumber: 1
zpe: 648790.8 jmol-1
zpe.correction: 0.247111 hartree
zpe.thermalcorrener: 0.266648 hartree
zpe.thermalcorrenthalpy: 0.267592 hartree
zpe.thermalcorrgfe: 0.194726 hartree
zpe.sumelectzpe: -1031.187435 hartree
zpe.sumelectthermal: -1031.167899 hartree
zpe.sumelectthermalent: -1031.166955 hartree
zpe.sumelectthermalfe: -1031.239820 hartree
dipole: 0.2150 1.4130 -0.9428
dipole: 1.7122
quadrupole: -70.1722 -85.5746 -105.5123
quadrupole: 2.2278 11.0158 -1.1818
quadrupole: 16.9141 1.5118 -18.4259 2.2278 11.0158 -1.1818
hfenergy: -1031.4345466 hartree
pointgroup: C01 [X(C8H17O5P1)]
dipole: 0.057965 -0.6092486 -0.2815074 debye
polarizability: 161.5929136|10.302985|128.4837352|-1.9698745|-10.1918706|116.5167712 unknown
InChI: InChI=1S/C8H17O5P/c1-4-11-7-8(9)14(10,12-5-2)13-6-3/h4-7H2,1-3H3
charge 0 multiplicity 1
31 atoms
P  0.807731 0.636094 0.675982
O  1.386535 2.260505 0.454891
O  1.830408 -0.375871 -0.314342
O  -3.175363 -0.240292 -0.287762
O  0.719827 0.238719 2.217989
O  -0.954953 0.964365 -1.484221
C  -0.865392 0.498403 -0.340278
C  -1.947473 -0.188282 0.465293
C  1.765821 2.765191 -0.905841
C  3.073138 -0.941693 0.299095
C  -4.262005 -0.906297 0.462858
C  2.587148 4.029594 -0.672688
C  3.565916 -2.027697 -0.652283
C  -5.496485 -0.894437 -0.434758
H  -2.051297 0.363544 1.430652
H  -1.567336 -1.202089 0.741078
H  2.342368 1.983834 -1.435863
H  0.839327 2.970655 -1.47249
H  3.814795 -0.127798 0.411991
H  2.828503 -1.342921 1.300715
H  -3.956449 -1.945556 0.714672
H  -4.448051 -0.358061 1.412246
H  2.878146 4.472076 -1.643864
H  1.999126 4.77529 -0.111421
H  3.501914 3.80413 -0.098695
H  4.498793 -2.474471 -0.260776
H  2.811888 -2.825975 -0.757192
H  3.77142 -1.608651 -1.651955
H  -6.346911 -1.38131 0.076033
H  -5.781738 0.141601 -0.684275
H  -5.294551 -1.433899 -1.375591
