program: Gaussian 09
title: 000121690
version: EM64L-G09RevD.01
frameworkgroup: C1[X(C8H10N2O4S)]
method: RPBEPBE
basis: SDD
operation: Freq
keyword: #p
keyword: freq=noraman
keyword: PBEPBE/SDD
title: #p freq=noraman PBEPBE/SDD
converged: YES YES NO NO
title: Mulliken charges:
elementType: S O O O O N N C C C C C C C C H H H H H H H H H H
charge: 0.922177 -0.550694 -0.538673 -0.197258 -0.265412 -0.374637 0.023355 -0.114197 0.316878 -0.360123 0.267826 -0.250242 -0.299985 -0.737445 -0.644258 0.332861 0.294848 0.260762 0.264433 0.296089 0.270335 0.355842 0.242733 0.244963 0.239823
chargesum: 0.00000
title: Mulliken charges with hydrogens summed into heavy atoms:
elementType: S O O O O N N C C C C C C C C
charge: 0.922177 -0.550694 -0.538673 -0.197258 -0.265412 -0.018796 0.023355 -0.114197 0.316878 -0.027262 0.267826 0.044606 -0.039224 0.093413 0.083261
polarizability: 2.09856569e+02 5.00307375e+00 1.70039510e+02 2.55688460e+00 -3.57541926e-01 8.17753401e+01
1716.lowfreq: -6.2903 0.0009 0.0009 0.0013 4.2331 8.1234 31.1977 61.7467 75.1602
frequency: 31.1905 61.7384 75.1585 100.1424 127.5044 154.7509 159.9325 184.0926 192.9142 212.6084 218.3734 240.3675 256.8556 303.8851 360.0863 370.6774 382.5229 405.0542 406.6623 437.0850 530.8859 575.9127 595.0231 626.1453 659.2815 674.9776 726.7603 764.8581 783.5068 785.4204 827.3595 832.4753 887.3050 939.9104 970.6595 982.3514 1007.9622 1047.7184 1068.3093 1075.7154 1114.9014 1127.8818 1172.3134 1181.5764 1239.1968 1302.3532 1307.1349 1337.6105 1372.8964 1406.9018 1421.8855 1429.0817 1444.9546 1475.4234 1483.3264 1490.2841 1524.4449 1583.7601 1620.6045 2968.7310 3029.5539 3042.0812 3113.5470 3149.0149 3162.1218 3179.4323 3179.7511 3184.0360 3338.8450
redmass: 6.2168 5.2483 6.0364 6.5325 3.0247 3.8579 1.0801 4.7067 1.2297 3.9346 7.3883 5.2315 5.0404 7.0562 6.0781 5.8609 8.5368 8.4206 7.0598 3.8887 3.6304 6.6126 5.3035 5.8346 8.8350 7.2644 3.1943 5.4140 1.4336 6.1492 1.5024 6.9964 3.1308 1.3946 1.3231 1.3284 1.8775 3.5566 3.9022 2.1802 1.2888 1.6706 3.5327 1.8220 1.4635 1.1482 2.6416 3.2462 3.2060 1.0527 1.0719 3.6222 1.3597 1.0416 2.2587 1.1151 3.2844 3.8854 6.6882 1.0373 1.0246 1.1011 1.0974 1.0899 1.0920 1.1062 1.0953 1.1080 1.0792
irintensity: 5.3058 2.9938 0.6880 1.9945 3.5731 0.5087 0.1671 1.3957 0.9001 2.9840 0.8842 11.5480 2.2643 8.8199 3.9955 9.0092 12.7102 38.9671 29.0279 0.0466 14.7142 46.3315 39.7108 21.3516 5.5099 2.1946 2.9882 1.7445 53.0451 125.3514 24.3668 12.6214 29.1578 16.9592 67.9656 1.0548 44.6195 18.2346 85.6559 11.0932 1.5160 8.7714 268.0408 71.1554 19.6029 6.0905 127.0692 70.4154 20.5452 9.1283 17.0373 3.5979 21.7270 17.2053 31.9244 6.7572 106.0939 109.4546 245.4939 67.9679 1.1450 31.7102 14.5942 3.9817 14.4845 0.1628 8.6944 0.9663 86.8994
temp: 298.150 k
press: 1.00000 atm
elementType: 16 8 8 8 8 7 7 6 6 6 6 6 6 6 6 1 1 1 1 1 1 1 1 1 1
symmnumber: 1
zpe: 469102.3 jmol-1
zpe.correction: 0.178672 hartree
zpe.thermalcorrener: 0.194107 hartree
zpe.thermalcorrenthalpy: 0.195051 hartree
zpe.thermalcorrgfe: 0.135526 hartree
zpe.sumelectzpe: -1117.944807 hartree
zpe.sumelectthermal: -1117.929372 hartree
zpe.sumelectthermalent: -1117.928428 hartree
zpe.sumelectthermalfe: -1117.987952 hartree
dipole: -3.8803 -5.5016 4.4541
dipole: 8.0724
quadrupole: -98.3655 -102.9636 -95.8852
quadrupole: 18.7770 15.9497 0.8254
quadrupole: 0.7059 -3.8922 3.1863 18.7770 15.9497 0.8254
hfenergy: -1118.1234788 hartree
pointgroup: C01 [X(C8H10N2O4S1)]
dipole: 1.4905117 -2.2926565 -1.6151295 debye
dipolederiv: 2.0802498 -0.0183289 0.032334 -0.1969712 1.0745921 0.0031947 0.1135451 -0.0123397 1.3593193 -0.7884812 -0.0524321 0.0175562 -0.0810203 -0.5941104 0.1319299 -0.0429363 0.0064665 -0.5565661 -0.7211277 0.0467621 -0.0232239 0.1638166 -0.5834532 -0.1380057 -0.0195764 -0.0112372 -0.5619837 -0.4090953 0.1887631 -0.0127358 -0.0109207 -1.0700571 0.0356571 -0.0008545 0.054702 -0.2200506 -0.9827226 -0.2399504 -0.0051948 -0.0135751 -0.4029612 0.0067038 0.0086253 0.0121984 -0.2721233 -1.3203316 0.5930689 -0.0423384 0.1911369 -0.4420961 0.0062243 -0.000184 -0.0035526 -0.3949816 1.1922307 0.4778893 -0.0023333 0.4053512 1.7481811 -0.0649697 -0.0243825 -0.081714 0.1975149 -0.4522708 -0.1735222 0.0214262 -0.0920759 -0.6766327 0.0098137 -0.0021379 0.0203763 -0.2717849 1.3701903 -0.5747043 0.03928 0.0346162 0.1489196 0.0036489 -0.0065435 -0.0002788 0.1540377 0.3218261 0.4943918 -0.0220314 0.2697864 0.0459858 0.0056432 0.0077205 0.0253841 -0.0333899 -0.6109985 -0.566512 0.0074363 -0.0300808 -0.7335001 0.0312997 -0.0155136 0.0305686 0.0011768 0.0507108 -0.2448558 0.0011917 -0.2847113 0.4003548 -0.0267041 0.0194516 -0.0476166 -0.0554831 -0.5733195 0.2812077 -0.0220569 -0.231094 0.1628798 -0.0185811 0.0011979 -0.019173 -0.1956156 -0.2625002 -0.002216 0.0034355 0.0246879 -0.1089753 0.0086693 -0.0085397 0.0181264 -0.2644845 0.3120575 -0.1819981 0.0102749 -0.3419776 0.4977233 -0.0160217 0.0142272 -0.0047885 0.2496365 0.1846831 -0.0015065 0.0054011 0.0365856 0.1242193 0.0077917 0.0016785 -0.0048924 0.1518968 0.137233 -0.0802259 0.007483 -0.0320411 0.0954004 -0.0029211 0.0043307 0.0081029 0.1455806 0.0224936 0.0774865 -0.0045223 0.0530502 -0.0306824 0.0111406 -0.0049629 0.0102573 0.1652394 0.109904 0.0426489 -0.0070985 0.0519639 -0.00446 -0.0385597 0.013042 -0.0375238 -0.0011309 -0.02472 0.0195701 -0.0053117 0.0248274 0.1208777 0.0025446 -0.064273 0.0033449 0.0669052 0.0785381 -0.0634042 -0.0007306 -0.0776245 0.023998 0.035167 0.0145576 0.0328732 0.012271 0.251542 0.045932 -0.0010231 -0.0084201 0.2493425 0.0026844 -0.002757 0.0019685 0.3178928 0.0820354 -0.0487481 0.0879536 0.1009795 -0.0552653 0.0724086 0.0075753 0.1177231 -0.069793 -0.1286439 0.0375365 -0.0029666 -0.0567573 0.0825994 0.0018248 0.002441 0.002142 0.1318284 0.0805167 -0.0568523 -0.0822053 0.1004681 -0.07288 -0.0705833 -0.0157314 -0.1211177 -0.0559122 unknown
polarizability: 209.4081241|-5.9322605|170.164745|4.9599879|-4.2574681|82.09855 unknown
InChI: InChI=1S/C8H10N2O4S/c1-9-7-4-3-6(15(2,13)14)5-8(7)10(11)12/h3-5,9H,1-2H3
charge 0 multiplicity 1
25 atoms
S  -3.077746 0.040667 0.12122
O  -3.741188 -1.345979 0.688143
O  -3.31306 1.494154 0.831601
O  1.371203 2.936649 -0.121239
O  3.207096 1.590897 -0.039217
N  2.919373 -1.012715 0.069549
N  1.902929 1.764199 -0.053012
C  -1.217203 -0.262397 0.037825
C  1.574094 -0.759439 0.057948
C  -0.35653 0.829131 0.006697
C  1.03962 0.589664 0.003399
C  -0.755501 -1.597882 0.102801
C  0.619632 -1.836555 0.110896
C  -3.637475 0.219122 -1.703388
C  3.507622 -2.351316 0.132422
H  -0.723594 1.860633 0.01228
H  -1.479671 -2.416678 0.178193
H  0.984699 -2.864896 0.167041
H  -3.37721 -0.718006 -2.214001
H  -4.724107 0.373706 -1.647391
H  -3.114908 1.093396 -2.114802
H  3.51512 -0.16932 0.040742
H  3.212677 -2.887446 1.055054
H  4.603942 -2.251956 0.131374
H  3.218085 -2.970035 -0.738836
