program: Gaussian 09
title: 000121718
version: EM64L-G09RevD.01
frameworkgroup: C1[X(C11H13F3N2)]
method: RPBEPBE
basis: SDD
operation: Freq
keyword: #p
keyword: freq=noraman
keyword: PBEPBE/SDD
title: #p freq=noraman PBEPBE/SDD
converged: YES YES NO NO
title: Mulliken charges:
elementType: F F F N N C C C C C C C C C C C H H H H H H H H H H H H H
charge: -0.174561 -0.174558 -0.177314 -0.186081 -0.295995 -0.338534 -0.343458 -0.407919 -0.419813 0.491062 -0.359669 -0.364350 0.291921 -0.362800 -0.356704 0.246723 0.228687 0.204961 0.212212 0.223916 0.194157 0.217615 0.219654 0.193408 0.275643 0.231001 0.221752 0.254712 0.254331
chargesum: 0.00000
title: Mulliken charges with hydrogens summed into heavy atoms:
elementType: F F F N N C C C C C C C C C C C
charge: -0.174561 -0.174558 -0.177314 -0.186081 -0.020352 0.095114 0.092671 0.003852 -0.006752 0.491062 -0.128667 -0.142598 0.291921 -0.108088 -0.102372 0.246723
polarizability: 2.12852980e+02 7.06174322e-02 1.27553398e+02 2.33524101e+00 2.86860457e+00 8.04558341e+01
1716.lowfreq: -12.2235 -9.7296 -0.0007 0.0005 0.0009 6.4352 11.0365 30.4600 49.1865
frequency: 9.8557 29.7390 49.1307 71.1573 117.2145 171.7207 215.5856 216.7937 246.8132 268.2524 352.3052 365.5316 374.5551 398.3291 409.6873 434.8766 451.8435 478.4499 495.3663 518.8778 554.1353 591.5673 630.3382 659.3471 675.4879 728.4339 740.6000 804.5116 817.3245 839.1252 866.1089 929.0280 934.3740 944.6622 959.0271 962.5726 979.6579 1013.1212 1026.5421 1039.9243 1049.6765 1072.4463 1095.9199 1134.6960 1151.2674 1171.2720 1203.9465 1208.6354 1240.4154 1247.1203 1287.6089 1301.1717 1314.0002 1328.1400 1345.0733 1367.0863 1371.7215 1385.6992 1394.8001 1440.9577 1446.0407 1454.4161 1458.8396 1462.1692 1468.3189 1524.7653 1563.7917 1630.7444 2871.5176 2877.9300 2940.0031 2946.6316 3045.4667 3048.4251 3077.8225 3106.4283 3148.0037 3150.7016 3169.3363 3176.3359 3470.4329
redmass: 6.7255 4.4955 3.4205 5.0475 7.1756 5.4961 6.0444 3.9224 2.2884 3.2224 6.2427 5.4661 2.9390 4.3399 3.0005 3.6797 3.1333 5.4364 1.9466 8.7963 3.1093 4.1621 7.0524 5.4173 1.5969 3.6879 5.7731 1.2918 1.8158 1.5411 3.3367 2.3800 2.7030 1.9539 1.5297 2.7007 5.4638 9.2623 2.9570 2.4656 1.7359 1.8814 2.2162 2.0802 1.6756 3.3031 1.1155 1.1450 1.4611 1.4082 1.3959 2.6087 1.3026 1.2664 1.3050 1.3375 4.1779 2.1567 1.6044 3.6201 1.3783 1.0912 1.0746 1.1236 1.1134 3.0041 6.8768 6.2689 1.0714 1.0696 1.0683 1.0705 1.0893 1.0915 1.0921 1.0903 1.0874 1.0884 1.0954 1.0953 1.0756
irintensity: 0.1259 0.1116 0.9220 0.3792 0.6682 2.1022 0.5510 1.2851 4.5406 14.5970 2.4532 4.1275 20.4455 6.8691 2.2378 1.1115 1.5139 1.4125 50.7454 1.4378 19.3398 74.9151 1.7794 19.2484 67.0103 8.4170 13.7122 0.9093 93.1445 5.4682 6.4242 34.9846 48.8487 98.9677 31.3487 126.8327 63.3748 173.6895 112.5820 34.4171 1.0842 1.8614 23.6985 13.2839 13.9706 19.1640 37.7211 97.1841 281.3022 24.1776 128.6673 272.0277 21.6596 16.0812 4.8877 1.7713 16.0354 72.2868 65.0329 3.4789 3.2476 4.9632 1.4205 39.9483 2.4981 57.5084 13.7260 329.5039 60.7490 121.4369 48.1780 88.7491 48.5230 48.0399 21.3891 16.9017 4.8384 5.0105 17.6331 7.2446 0.3622
temp: 298.150 k
press: 1.00000 atm
elementType: 9 9 9 7 7 6 6 6 6 6 6 6 6 6 6 6 1 1 1 1 1 1 1 1 1 1 1 1 1
symmnumber: 1
zpe: 595272.3 jmol-1
zpe.correction: 0.226727 hartree
zpe.thermalcorrener: 0.241119 hartree
zpe.thermalcorrenthalpy: 0.242063 hartree
zpe.thermalcorrgfe: 0.182742 hartree
zpe.sumelectzpe: -834.791710 hartree
zpe.sumelectthermal: -834.777319 hartree
zpe.sumelectthermalent: -834.776375 hartree
zpe.sumelectthermalfe: -834.835696 hartree
dipole: -7.6585 0.0979 0.3325
dipole: 7.6664
quadrupole: -99.6820 -83.5476 -98.2907
quadrupole: -0.7365 -5.5965 0.4930
quadrupole: -5.8419 10.2925 -4.4506 -0.7365 -5.5965 0.4930
hfenergy: -835.0184375 hartree
pointgroup: C01 [X(C11H13F3N2)]
dipole: -3.0140933 0.0668104 0.0900369 debye
polarizability: 212.7739507|-0.2890654|127.7214288|3.975865|-0.5694992|80.3668323 unknown
InChI: InChI=1S/C11H13F3N2/c12-11(13,14)9-1-3-10(4-2-9)16-7-5-15-6-8-16/h1-4,15H,5-8H2
charge 0 multiplicity 1
29 atoms
F  4.302268 -1.121332 -0.512298
F  4.297072 1.155015 -0.415424
F  4.172717 -0.065752 1.485044
N  -2.063179 -0.003216 -0.092961
N  -4.931207 0.019002 -0.031713
C  -2.836215 1.142316 -0.634746
C  -2.826499 -1.271669 -0.083497
C  -4.190662 1.291504 0.082596
C  -4.192474 -1.08581 0.609614
C  -0.659466 -0.00436 -0.085789
C  0.091529 -1.224996 -0.139309
C  0.08922 1.215989 0.003331
C  2.211543 -0.007912 0.019836
C  1.493752 -1.222969 -0.078869
C  1.489632 1.210666 0.059104
C  3.695912 -0.010171 0.131668
H  -3.028217 0.978307 -1.717639
H  -2.263883 2.074694 -0.527344
H  -2.262436 -2.034845 0.476703
H  -2.990057 -1.639444 -1.120455
H  -4.000727 1.588399 1.143826
H  -4.768588 2.096506 -0.406093
H  -4.771041 -2.021693 0.508369
H  -4.007481 -0.905493 1.697834
H  -5.907072 0.0877 0.280591
H  -0.416103 -2.184892 -0.2594
H  -0.42288 2.180048 0.057144
H  2.036582 -2.172028 -0.135873
H  2.029162 2.16044 0.132751
