program: Gaussian 09
title: 000121712
version: EM64L-G09RevD.01
frameworkgroup: C1[X(C16H22O4)]
method: RPBEPBE
basis: SDD
operation: Freq
keyword: #pfreq=noraman
keyword: PBEPBE/SDD
title: #p freq=noraman PBEPBE/SDD
converged: YES YES NO NO
title: Mulliken charges:
elementType: O O O O C C C C C C C C C C C C C C C C H H H H H H H H H H H H H H H H H H H H H H
charge: -0.292680 -0.307250 -0.256654 -0.260338 0.343678 0.331755 -0.710534 -0.717689 -0.727427 -0.704608 -0.701362 -0.711340 0.202796 0.141219 0.177606 0.205714 -0.376535 -0.337265 -0.222203 -0.224509 0.219231 0.210477 0.265571 0.239656 0.227002 0.203083 0.259410 0.205520 0.257672 0.223951 0.212148 0.257513 0.224434 0.231805 0.205280 0.267555 0.213549 0.220437 0.266700 0.264866 0.236791 0.234971
chargesum: 0.00000
title: Mulliken charges with hydrogens summed into heavy atoms:
elementType: O O O O C C C C C C C C C C C C C C C C
charge: -0.292680 -0.307250 -0.256654 -0.260338 0.343678 0.331755 -0.015254 -0.047948 -0.004824 -0.010994 -0.039843 -0.009798 0.202796 0.141219 0.177606 0.205714 -0.109836 -0.072399 0.014588 0.010462
polarizability: 2.12490269e+02 -2.97558443e+00 2.25655998e+02 -9.26612420e+00 -8.62082714e+00 1.29557691e+02
1716.lowfreq: -8.1679 -0.0004 0.0004 0.0007 1.7145 7.4320 24.5588 39.6511 49.3149
frequency: 24.2426 39.6477 49.3078 62.2030 74.8941 98.3771 109.4060 123.1491 154.9882 167.3191 173.4638 183.2127 190.6412 211.0441 225.5994 227.6278 236.3171 245.1999 251.3268 296.3218 303.2118 309.5437 333.8340 338.3683 355.6612 394.0079 406.9856 411.9077 433.9190 440.8773 451.6764 456.6497 522.9662 532.1647 641.0993 658.7831 676.4292 703.1703 715.8547 731.1024 783.6963 786.8027 794.4106 805.8165 819.2564 844.3444 901.3860 916.4741 918.6770 921.0940 921.4685 953.0438 956.7094 973.7857 1001.6571 1026.7362 1028.4123 1029.6856 1033.4054 1036.1508 1036.8451 1084.0881 1116.4298 1170.4663 1175.8382 1178.0262 1237.6286 1249.2317 1256.4787 1257.8463 1270.1542 1274.3507 1281.7244 1372.0807 1374.3442 1377.3686 1378.2294 1379.5417 1398.8071 1400.2182 1427.5738 1442.9809 1443.5762 1464.7926 1466.0780 1466.5072 1467.2391 1468.5717 1469.3351 1474.3072 1478.9599 1481.1428 1502.0147 1502.9705 1576.8701 1598.8030 1607.1186 1611.3611 2988.4827 2989.5258 2990.8728 2991.1285 2995.5730 2996.0570 3080.2525 3080.9911 3083.9732 3088.3541 3095.0770 3095.4263 3098.7746 3099.1868 3114.0414 3114.2046 3117.9331 3119.7511 3136.2475 3151.5954 3166.3949 3178.7933
redmass: 3.7502 3.3551 3.5202 3.8015 3.8150 4.4280 4.2795 3.6234 2.2041 1.2272 1.5572 2.4572 4.0137 3.2638 1.0797 1.0971 1.1697 1.2397 2.5237 3.1432 3.4810 4.7171 2.6958 2.7826 4.6737 2.9263 2.8749 2.9434 2.7865 2.7982 3.3231 2.9491 4.1794 4.5257 6.2425 5.4677 6.7941 3.7128 6.2870 6.8384 2.4553 2.6105 3.7667 3.9502 3.4957 5.3319 1.4677 1.5938 1.5899 1.6221 1.6356 1.2046 1.2050 1.4004 1.3535 1.4377 1.4546 3.5955 1.5943 1.5733 2.9847 3.4783 1.9309 2.0492 1.1468 1.8092 3.7044 2.9226 3.0144 3.0537 2.3102 3.1803 2.0551 1.2285 1.2275 1.2463 1.2293 9.8807 1.2150 1.2168 2.1947 1.0472 1.0474 1.0633 1.0695 1.0645 1.0584 1.0691 1.0670 2.4271 1.0519 1.0513 1.0570 1.0591 7.2939 7.3631 9.1530 8.9761 1.0362 1.0359 1.0358 1.0355 1.0367 1.0366 1.0991 1.0994 1.0992 1.0989 1.0991 1.0995 1.1000 1.1000 1.1002 1.1000 1.0998 1.0990 1.0861 1.0910 1.0962 1.0977
irintensity: 0.2645 0.4765 0.3337 4.4561 0.2575 2.4048 0.6257 0.5253 0.4051 0.0752 0.2346 2.0483 2.7382 3.0179 0.3733 0.0645 0.4213 0.2910 0.5335 2.3962 5.7499 8.1240 1.9203 1.3924 5.9248 2.9867 0.4199 0.3759 2.5217 2.3853 3.3184 0.7766 0.2293 6.8654 3.6832 0.6123 2.2845 70.7244 16.3411 11.3452 22.4285 22.9649 8.4725 3.9648 20.1745 6.4493 0.9869 0.6476 0.9853 1.1891 0.3237 0.2246 0.3058 3.3635 2.0403 2.4058 7.1630 143.5234 16.9163 28.2000 114.1377 291.0206 91.7217 145.3857 43.3245 192.6633 89.1303 215.1192 35.1451 19.8722 17.5992 27.9925 35.6188 44.2643 32.7736 45.7485 33.6093 12.8898 30.1067 36.5080 6.5692 0.1218 0.7150 24.0762 11.4691 4.8402 8.6828 10.8366 2.6377 7.7459 3.5739 6.5251 26.5265 32.4994 30.8015 126.0178 106.2620 82.7679 19.1906 20.5178 10.0270 17.7802 27.1608 37.1655 13.3026 10.6327 20.6717 2.9114 34.7864 73.0772 48.8028 18.7721 3.7008 9.5728 15.1950 15.6687 2.0378 10.0084 14.1603 14.1404
temp: 298.150 k
press: 1.00000 atm
elementType: 8 8 8 8 6 6 6 6 6 6 6 6 6 6 6 6 6 6 6 6 1 1 1 1 1 1 1 1 1 1 1 1 1 1 1 1 1 1 1 1 1 1
symmnumber: 1
zpe: 905621.3 jmol-1
zpe.correction: 0.344933 hartree
zpe.thermalcorrener: 0.367056 hartree
zpe.thermalcorrenthalpy: 0.368000 hartree
zpe.thermalcorrgfe: 0.294269 hartree
zpe.sumelectzpe: -922.300379 hartree
zpe.sumelectthermal: -922.278256 hartree
zpe.sumelectthermalent: -922.277312 hartree
zpe.sumelectthermalfe: -922.351043 hartree
dipole: 2.8706 -0.4330 -2.2928
dipole: 3.6993
quadrupole: -110.2186 -101.2196 -126.4452
quadrupole: 1.3124 5.5806 -1.2027
quadrupole: 2.4092 11.4082 -13.8174 1.3124 5.5806 -1.2027
hfenergy: -922.6453118 hartree
pointgroup: C01 [X(C16H22O4)]
dipole: 1.0263154 -0.1951377 -1.0133046 debye
polarizability: 209.735138|-0.7861644|226.70107|-17.0332337|0.7359222|131.2677503 unknown
InChI: InChI=1S/C16H22O4/c1-15(2,3)19-13(17)11-9-7-8-10-12(11)14(18)20-16(4,5)6/h7-10H,1-6H3
charge 0 multiplicity 1
42 atoms
O  -1.818178 -0.453878 -0.324968
O  2.184328 -0.177618 -0.486494
O  -2.850015 0.673027 1.459372
O  0.625959 -0.850546 1.134679
C  -2.686924 -1.712252 -0.224835
C  3.023156 -1.454303 -0.408461
C  -4.153533 -1.330429 -0.508161
C  -2.101723 -2.587927 -1.345609
C  -2.48686 -2.354528 1.16204
C  2.155575 -2.659856 -0.821671
C  4.125514 -1.172846 -1.443686
C  3.603725 -1.596549 1.012963
C  -0.900362 1.632959 0.364499
C  0.479079 1.369234 0.120456
C  -1.94129 0.569059 0.597722
C  1.061817 -0.002102 0.31767
C  -1.365878 2.970193 0.356555
C  1.347837 2.449375 -0.180747
C  -0.490471 4.039253 0.07101
C  0.868816 3.775742 -0.213084
H  -4.240642 -0.82444 -1.48622
H  -4.77093 -2.247244 -0.537853
H  -4.546547 -0.666257 0.277358
H  -1.043651 -2.822966 -1.138877
H  -2.162165 -2.066967 -2.316853
H  -2.667665 -3.53408 -1.41647
H  -2.961221 -1.75412 1.953743
H  -2.938157 -3.363768 1.161566
H  -1.410216 -2.445225 1.385902
H  1.687495 -2.478083 -1.805442
H  2.795301 -3.557558 -0.903982
H  1.367228 -2.852626 -0.077762
H  4.70622 -0.277173 -1.162495
H  3.68635 -1.004762 -2.441961
H  4.814634 -2.034262 -1.501066
H  2.810219 -1.78444 1.7526
H  4.314198 -2.443235 1.032694
H  4.15293 -0.682106 1.299933
H  -2.423076 3.154987 0.571951
H  2.402177 2.233367 -0.372733
H  -0.86744 5.067521 0.065384
H  1.554284 4.59823 -0.443665
