program: Gaussian 09
title: 000121714
version: EM64L-G09RevD.01
frameworkgroup: C1[X(C6H12N2O6S2)]
method: RPBEPBE
basis: SDD
operation: Freq
keyword: #p
keyword: freq=noraman
keyword: PBEPBE/SDD
title: #p freq=noraman PBEPBE/SDD
converged: YES YES NO NO
title: Mulliken charges:
elementType: S S O O O O O O N N C C C C C C H H H H H H H H H H H H
charge: 0.835076 0.027073 -0.528852 -0.525774 -0.384645 -0.225873 -0.421046 -0.215366 -0.602618 -0.609444 -0.575251 -0.154879 -0.764550 -0.084821 0.193338 0.174250 0.305931 0.299403 0.307460 0.312328 0.319391 0.265114 0.310675 0.326100 0.324180 0.318360 0.392738 0.381703
chargesum: 0.00000
title: Mulliken charges with hydrogens summed into heavy atoms:
elementType: S S O O O O O O N N C C C C C C
charge: 0.835076 0.027073 -0.528852 -0.525774 0.008093 -0.225873 -0.039343 -0.215366 0.034157 0.033096 0.030083 0.152580 -0.132832 0.180294 0.193338 0.174250
polarizability: 2.60024181e+02 -6.92264387e+00 1.41816356e+02 5.10578301e+00 7.01102049e+00 1.17185590e+02
1716.lowfreq: -2.8007 -0.0026 -0.0011 -0.0003 3.3499 12.2255 17.3798 26.9407 33.1268
frequency: 17.0950 26.6879 33.1133 39.5856 51.5760 62.5227 67.1850 79.1749 117.8091 145.2336 162.3164 177.7691 189.5166 202.7108 221.6023 237.5952 249.9864 272.1337 278.1332 291.8228 330.7774 350.4166 395.2074 421.0542 436.7301 478.1869 484.4524 489.8136 558.1825 573.0467 592.1951 596.8848 619.7834 647.1570 712.5661 733.7278 758.4535 794.3804 800.3455 837.6302 878.4164 943.5937 955.6723 1018.5662 1037.8860 1060.0521 1083.0072 1098.7970 1115.7845 1126.3753 1177.7180 1217.5343 1224.0687 1234.5280 1265.7294 1273.6963 1307.5942 1327.7449 1375.0535 1380.8255 1400.3448 1401.2190 1605.7459 1612.7252 1663.6122 1678.8702 2974.0424 3031.9782 3060.1687 3065.5403 3072.2164 3163.6164 3512.7165 3512.8706 3518.8718 3519.6532 3657.8769 3673.1282
redmass: 8.6861 7.7714 7.9397 7.5640 7.3815 8.2866 6.1121 5.9332 5.7107 6.5860 5.1721 1.7757 5.4843 3.7766 2.6977 6.1989 3.8486 3.5103 3.3258 3.7606 3.2908 2.6877 2.6210 2.7090 3.8422 2.1139 1.9154 1.4805 4.7865 1.7256 1.8653 4.1961 1.9783 2.3156 3.9896 5.1751 3.0874 15.6483 2.5236 2.3189 3.4979 2.3554 3.8197 5.2260 2.7423 2.0664 1.3345 1.3929 1.3669 1.8386 1.7213 1.2903 1.8701 1.2572 1.5460 1.4891 1.3044 1.3052 1.5955 1.3523 1.3258 1.1079 1.1856 1.2032 5.6994 5.3667 1.0594 1.0852 1.0575 1.1025 1.0850 1.1123 1.0639 1.0638 1.0450 1.0459 1.1029 1.1020
irintensity: 1.6529 7.5760 0.9151 5.0536 5.2064 15.5458 2.2009 0.7732 4.5896 12.8727 3.0804 59.7472 49.6066 12.0677 18.2209 1.2208 26.7883 8.8048 37.1850 0.4202 154.6310 48.5554 15.1229 327.2465 17.5605 169.5512 190.8345 51.0012 3.8748 94.7821 93.0291 39.9114 76.8803 81.9793 38.5793 17.6529 23.0627 33.3425 47.4921 15.4867 31.3668 33.4495 29.8071 84.8032 318.8690 160.0593 37.3712 14.9429 15.8088 36.5832 19.5782 4.0768 7.5934 10.7349 6.1615 4.6164 61.2979 11.2873 4.7842 3.9249 15.0310 27.6073 111.5973 73.0239 168.9465 180.3169 3.1662 16.0225 1.8436 0.0004 4.4970 0.1710 23.8710 30.7735 36.4904 74.7958 27.6074 37.7406
temp: 298.150 k
press: 1.00000 atm
elementType: 16 16 8 8 8 8 8 8 7 7 6 6 6 6 6 6 1 1 1 1 1 1 1 1 1 1 1 1
symmnumber: 1
zpe: 518954.4 jmol-1
zpe.correction: 0.197659 hartree
zpe.thermalcorrener: 0.218104 hartree
zpe.thermalcorrenthalpy: 0.219048 hartree
zpe.thermalcorrgfe: 0.145239 hartree
zpe.sumelectzpe: -1591.384688 hartree
zpe.sumelectthermal: -1591.364243 hartree
zpe.sumelectthermalent: -1591.363299 hartree
zpe.sumelectthermalfe: -1591.437108 hartree
dipole: 3.1687 -2.5514 -1.1896
dipole: 4.2385
quadrupole: -83.5258 -110.8294 -116.8119
quadrupole: -0.6301 13.6919 -0.6201
quadrupole: 20.1966 -7.1070 -13.0896 -0.6301 13.6919 -0.6201
hfenergy: -1591.5823472 hartree
pointgroup: C01 [X(C6H12N2O6S2)]
dipole: 1.3178366 0.4138556 0.9342305 debye
polarizability: 258.1176765|15.8821757|123.0504053|-9.997485|10.6734406|137.8580448 unknown
InChI: InChI=1S/C3H6NO4S.C3H6NO2S/c4-2(3(5)6)1-9(7)8;4-2(1-7)3(5)6/h2,5H,1,4H2;2,5H,1,4H2
charge 0 multiplicity 1
28 atoms
S  0.503497 0.677818 -0.051287
S  -1.007634 1.350247 1.807855
O  0.459416 1.722272 -1.309198
O  0.268482 -0.926582 -0.292087
O  2.916149 -0.771506 -1.969325
O  4.082206 -1.586464 -0.12303
O  -5.183131 -0.566081 1.151524
O  -4.364455 -1.479557 -0.823908
N  4.612158 1.139254 0.564325
N  -2.575308 0.673214 -1.071202
C  2.236657 0.915759 0.800715
C  3.422589 0.78879 -0.196977
C  -2.254075 0.019901 1.375748
C  -3.212813 0.46766 0.21117
C  3.522873 -0.649302 -0.732797
C  -4.286216 -0.617977 0.073573
H  2.184437 1.937233 1.206022
H  2.249946 0.153756 1.595836
H  3.259796 1.480148 -1.040052
H  -2.812774 -0.174724 2.309913
H  -1.681811 -0.885748 1.089438
H  -3.716351 1.394989 0.540077
H  5.179491 1.921247 0.245973
H  5.096897 0.366899 1.024383
H  -2.003419 1.504837 -1.216448
H  -2.313983 -0.15813 -1.601448
H  2.873877 -1.724522 -2.255301
H  -5.852401 -1.297832 1.061508
