program: Gaussian 09
title: 000121659
version: EM64L-G09RevD.01
frameworkgroup: C1[X(C13H10O2)]
method: RPBEPBE
basis: SDD
operation: Freq
keyword: #pfreq=noraman
keyword: PBEPBE/SDD
title: #p freq=noraman PBEPBE/SDD
converged: YES YES NO NO
title: Mulliken charges:
elementType: O O C C C C C C C C C C C C C H H H H H H H H H H
charge: -0.187981 -0.207396 0.365091 0.281669 0.441190 -0.382128 -0.342972 -0.393016 -0.394069 0.018565 -0.492901 -0.803955 0.156172 -0.261686 -0.278843 0.241613 0.266426 0.234575 0.234937 0.275322 0.263475 0.229275 0.228000 0.241707 0.266929
chargesum: 0.00000
title: Mulliken charges with hydrogens summed into heavy atoms:
elementType: O O C C C C C C C C C C C C C
charge: -0.187981 -0.207396 0.365091 0.281669 0.441190 -0.140515 -0.076546 -0.158441 -0.159132 0.018565 -0.217579 -0.104974 0.156172 0.001789 -0.011914
polarizability: 2.65363112e+02 -2.31627615e+01 1.53258973e+02 -3.68689060e+00 -4.51183535e+00 6.91492927e+01
1716.lowfreq: -7.2533 -0.0004 -0.0002 0.0006 1.8431 5.3851 46.1962 58.1045 61.2814
frequency: 46.0597 58.0955 61.2750 74.2996 119.5316 172.3279 237.0700 251.6288 279.8447 316.4686 368.5679 403.2591 405.8940 429.6956 452.3700 495.4233 518.7256 583.1251 617.0425 633.8846 648.2224 722.5027 768.3870 780.4106 786.5213 820.1990 840.3150 847.2663 855.5680 913.8460 955.7560 968.8879 976.0341 989.6605 997.8144 1014.0171 1045.6546 1085.3734 1133.8829 1195.6275 1206.8463 1230.8152 1260.1930 1276.7774 1317.7771 1338.0718 1353.1852 1366.2987 1397.7987 1415.2234 1467.6602 1473.0170 1502.2106 1520.2522 1551.7900 1561.1992 1578.1346 1618.7086 1637.3998 2976.6535 3058.5355 3089.3320 3123.0433 3130.4265 3143.4831 3146.4798 3150.2105 3169.5412 3187.2519
redmass: 1.0335 4.5243 4.0645 5.9705 6.5100 4.7390 4.9063 7.2716 4.0998 4.1507 3.2818 4.8528 3.9834 3.5472 10.2725 3.6227 3.4690 5.0114 3.0139 5.9216 6.3726 2.9932 4.0863 3.2146 4.2325 1.6427 1.8340 2.0241 2.3713 1.5915 1.5519 2.1909 1.6016 1.4046 1.2997 2.7710 1.5850 1.6531 1.3404 1.5666 1.2823 2.9536 1.8324 2.7269 1.3533 2.8440 2.1615 4.7573 1.2209 3.4183 1.1063 1.0577 2.9686 7.4735 8.0947 5.4873 8.0362 6.3146 6.9830 1.0391 1.0942 1.1000 1.0873 1.0905 1.0868 1.0950 1.0929 1.1012 1.0942
irintensity: 0.5403 1.8453 2.0839 4.1763 4.3184 1.4660 1.5524 0.4806 0.2888 0.3554 1.2068 29.0384 9.3900 6.5914 1.5269 2.1659 9.9241 1.4867 12.2445 1.5050 1.6597 5.6155 10.7745 0.8417 1.9678 16.7589 3.0901 8.9182 46.9374 41.6499 3.8576 6.8511 9.2591 0.4196 0.3726 1.1111 29.2571 110.2228 9.1917 18.6780 10.3023 5.0988 58.2086 90.9564 14.1141 36.1215 10.6684 14.5574 13.9039 5.4442 16.9163 14.3182 9.6185 42.0990 261.3606 128.0113 135.9293 65.8768 6.6096 25.7484 21.8028 16.0929 10.6984 23.1805 0.9690 5.1581 14.0277 10.9581 2.2628
temp: 298.150 k
press: 1.00000 atm
elementType: 8 8 6 6 6 6 6 6 6 6 6 6 6 6 6 1 1 1 1 1 1 1 1 1 1
symmnumber: 1
zpe: 497161.1 jmol-1
zpe.correction: 0.189359 hartree
zpe.thermalcorrener: 0.202276 hartree
zpe.thermalcorrenthalpy: 0.203220 hartree
zpe.thermalcorrgfe: 0.148848 hartree
zpe.sumelectzpe: -650.768718 hartree
zpe.sumelectthermal: -650.755801 hartree
zpe.sumelectthermalent: -650.754857 hartree
zpe.sumelectthermalfe: -650.809228 hartree
dipole: -2.6973 0.4302 -0.0939
dipole: 2.7330
quadrupole: -75.5849 -93.6377 -88.4905
quadrupole: 12.7129 1.6872 -5.4119
quadrupole: 10.3195 -7.7334 -2.5861 12.7129 1.6872 -5.4119
hfenergy: -650.9580766 hartree
pointgroup: C01 [X(C13H10O2)]
dipole: -1.0574866 -0.1043215 0.1641935 debye
dipolederiv: -0.5741214 -0.111228 0.0473338 -0.0027156 -0.6747395 0.1886574 0.0923414 0.1915349 -0.394593 -0.9953806 -0.1376507 0.0979028 -0.4867278 -0.6165048 0.1726273 0.2500357 0.164399 -0.4311465 -0.6981876 -0.0565614 0.058082 0.1971332 -0.0531996 0.0118924 -0.0243923 0.0246264 -0.0315088 1.0263721 0.1967013 -0.1256968 0.2821601 -0.1953618 0.1220676 -0.270563 0.1315367 -0.0689435 0.7024319 -0.0093296 0.0049305 0.076121 -0.0011479 -0.0143235 -0.0041029 -0.0293821 0.0294663 0.2676756 0.0200788 -0.0745525 -0.3147116 -0.1212708 -0.045942 0.1684229 -0.0324633 -0.0007303 0.3245223 -0.0395441 0.0466496 0.1702576 -0.0338434 -0.1018887 -0.159227 -0.043756 0.0111286 -0.5010666 -0.0592294 0.1038769 -0.1580965 -0.1123373 -0.0894738 0.3446882 -0.0894037 0.0099018 -0.3902469 0.0688128 -0.119747 0.2038229 -0.11214 -0.0999464 -0.3538598 -0.0921524 0.0117465 0.8489001 0.0307732 -0.0110742 -0.0843581 0.7304497 -0.2487738 -0.0972814 -0.2948992 0.3381098 -1.3170086 -0.0971036 0.0701906 -0.2853908 0.0369834 -0.0604841 0.3015616 -0.0695874 -0.1079984 -0.2960563 -0.0023082 -0.00642 -0.1742197 0.0661684 -0.0085339 -0.1034318 -0.0121587 0.0735153 1.7576804 0.0482644 -0.0766252 0.1218602 0.6511809 -0.259434 -0.0113443 -0.2561193 0.355351 -0.4196795 -0.1018694 0.0608174 -0.039828 0.0702511 -0.1065357 0.0240665 -0.0962266 -0.058155 0.1821989 0.1311042 -0.0774259 0.1981397 -0.2351043 0.0636443 -0.1316419 0.0776252 -0.1428629 0.0325544 -0.034974 0.0962028 -0.0080565 0.1109339 0.0655391 0.0624762 0.0464044 0.0104282 0.0902683 0.0345791 -0.0640813 -0.0027477 0.1037867 0.0758505 -0.0705467 0.0344636 0.0460586 0.0076087 0.0477831 -0.074098 0.0859402 0.102811 0.0858322 -0.0759271 0.0854553 -0.0117367 -0.0099786 -0.0348579 0.0927484 -0.053643 0.1108367 0.0728811 0.0991264 0.0783873 -0.0094319 0.0139295 0.0584105 -0.0230449 0.0865885 0.0243744 0.0524146 -0.0479869 0.0605623 0.114295 0.03774 0.0298706 -0.0158675 0.0777437 0.0210932 0.0731742 -0.0579274 0.0721529 0.1141814 0.015933 0.0149987 0.0330908 0.0519262 0.1076201 0.0102613 0.1311877 -0.0161172 -0.1059053 0.0221947 0.0218519 -0.002797 0.1287399 -0.042923 0.0919932 -0.0311514 0.1151096 0.0382355 -0.0512167 -0.0492624 -0.0295019 -0.0734361 -0.0372792 -0.0830628 -0.045221 -0.0800518 0.0710442 -0.0770671 0.0306898 -0.0108935 0.0034983 0.0993621 0.0315638 0.0106982 0.0300604 0.13955 unknown
polarizability: 264.8065941|18.3405637|117.3072933|-16.2744478|-42.3021205|105.6574896 unknown
InChI: InChI=1S/C13H10O2/c1-9-2-4-10(5-3-9)12-8-11(14)6-7-13(12)15/h2-8H,1H3
charge 0 multiplicity 1
25 atoms
O  0.888453 -2.200793 1.14748
O  3.687233 1.867958 -1.172505
C  -0.699996 0.018973 0.011039
C  0.780885 -0.036678 0.010267
C  -3.568383 0.238558 0.000425
C  -1.388341 0.649849 -1.066257
C  -1.479834 -0.507933 1.080888
C  -2.790665 0.755995 -1.070144
C  -2.88322 -0.389629 1.072794
C  1.503604 -1.210905 0.636927
C  1.546402 0.957613 -0.569718
C  -5.082364 0.325341 -0.019307
C  3.020302 0.93169 -0.615143
C  2.992852 -1.212172 0.623302
C  3.713713 -0.217986 0.028612
H  -0.819492 1.029657 -1.922551
H  -0.984113 -1.000513 1.91991
H  -3.293647 1.236484 -1.917816
H  -3.458438 -0.792228 1.914985
H  1.08243 1.849403 -1.00565
H  3.462552 -2.076579 1.105783
H  -5.498718 0.380378 1.001645
H  -5.432035 1.207928 -0.582898
H  -5.521468 -0.568619 -0.504105
H  4.808891 -0.214391 -0.004262
