program: Gaussian 09
title: 000121667
version: EM64L-G09RevD.01
frameworkgroup: C1[X(C8H16O6)]
method: RPBEPBE
basis: SDD
operation: Freq
keyword: #pfreq=noraman
keyword: PBEPBE/SDD
title: #p freq=noraman PBEPBE/SDD
converged: NO YES NO NO
title: Mulliken charges:
elementType: O O O O O O C C C C C C C C H H H H H H H H H H H H H H H H
charge: -0.283749 -0.276690 -0.419683 -0.430389 -0.428109 -0.433904 -0.111047 -0.208360 -0.131778 -0.066933 -0.000197 -0.351390 -0.210820 -0.676064 0.199577 0.268040 0.249912 0.211172 0.188545 0.202883 0.232379 0.353919 0.334136 0.354913 0.192086 0.219417 0.350568 0.211407 0.235622 0.224536
chargesum: 0.00000
title: Mulliken charges with hydrogens summed into heavy atoms:
elementType: O O O O O O C C C C C C C C
charge: -0.283749 -0.276690 -0.065764 -0.096253 -0.073195 -0.083336 0.088530 0.059680 0.118134 0.144238 0.188348 0.083873 0.200683 -0.004499
polarizability: 1.32045768e+02 8.22104700e-01 1.08447888e+02 9.03395000e-01 9.95780690e-01 8.36461805e+01
1716.lowfreq: -7.8925 -1.1299 0.0007 0.0009 0.0011 9.7270 34.3646 48.4500 69.4941
frequency: 34.1847 48.4165 69.4827 88.1975 97.6151 104.8485 163.2498 181.1118 230.5805 234.0763 242.3798 268.9370 276.8133 291.7510 335.1019 344.8211 374.4958 384.8276 406.8499 429.6519 456.1161 466.2137 480.8364 552.6765 576.0933 599.5043 606.3873 810.0396 839.6491 849.9803 924.8225 942.8403 963.9742 984.9517 1008.6510 1020.8758 1024.9442 1028.2912 1060.6906 1071.4553 1090.8788 1104.5074 1118.3599 1123.4782 1137.8474 1165.0420 1185.4469 1198.6492 1237.5505 1249.7172 1252.5815 1264.3587 1279.8068 1311.1125 1324.6469 1331.8196 1338.0344 1345.0695 1347.7213 1368.0915 1380.7021 1386.7199 1399.9938 1418.1724 1460.9932 1461.6625 1477.5990 1489.4030 2890.2527 2910.9350 2919.9231 2956.9094 2973.5675 2996.3893 3007.5575 3035.8911 3065.5734 3094.7034 3101.3651 3104.3030 3522.4161 3524.7187 3544.4643 3554.1611
redmass: 2.5025 3.8731 3.1513 5.1246 4.2615 4.7082 3.6099 2.6808 3.9424 3.2495 1.4217 4.5516 3.9888 2.8718 1.3409 3.3540 1.7752 2.3816 5.1903 1.6856 1.1333 2.0611 3.7354 3.8926 3.4666 3.7613 3.8377 1.0997 2.7676 2.7502 5.4637 8.0361 5.9379 3.8956 3.8994 2.2545 2.9282 3.4472 2.9936 3.8897 3.0309 3.2905 2.0792 2.1759 1.5070 1.2375 1.3230 1.2857 1.2469 1.1671 1.2320 1.1572 1.1912 1.2829 1.2529 1.2947 1.3351 1.3264 1.3606 1.2007 1.3002 1.3312 1.3709 1.7319 1.0407 1.0837 1.0528 1.0786 1.0823 1.0821 1.0820 1.0618 1.0688 1.0360 1.0847 1.1009 1.0856 1.0990 1.0953 1.1015 1.0655 1.0655 1.0653 1.0655
irintensity: 0.1132 1.7083 1.4779 11.9799 2.6868 0.4190 1.9063 8.4091 23.1190 6.0524 3.6377 6.0462 8.2063 6.2325 49.9285 2.6090 107.7118 47.6581 14.8676 116.8302 189.8148 81.1633 23.7135 21.2775 27.6162 5.1866 38.6666 5.0450 16.8843 5.3376 54.1401 337.2979 87.8633 6.9765 18.7080 23.1459 75.8737 124.7171 122.9382 9.5895 20.2143 33.2970 30.8571 10.0557 8.5289 30.8133 4.2995 35.5118 13.2561 4.8205 11.0280 44.1877 27.5502 21.6975 0.2575 24.2508 11.2728 5.9166 18.5798 21.1496 25.4273 17.4090 8.4328 7.0663 12.0235 5.1452 6.3439 6.3934 29.6674 7.4211 86.4002 50.2055 56.8722 20.7993 28.1608 24.5850 16.3964 30.9087 16.6982 37.4051 19.1441 1.8264 7.1445 11.1242
temp: 298.150 k
press: 1.00000 atm
elementType: 8 8 8 8 8 8 6 6 6 6 6 6 6 6 1 1 1 1 1 1 1 1 1 1 1 1 1 1 1 1
symmnumber: 1
zpe: 641972.9 jmol-1
zpe.correction: 0.244515 hartree
zpe.thermalcorrener: 0.260495 hartree
zpe.thermalcorrenthalpy: 0.261439 hartree
zpe.thermalcorrgfe: 0.201036 hartree
zpe.sumelectzpe: -764.584848 hartree
zpe.sumelectthermal: -764.568868 hartree
zpe.sumelectthermalent: -764.567924 hartree
zpe.sumelectthermalfe: -764.628327 hartree
dipole: -1.9671 1.0192 1.7775
dipole: 2.8404
quadrupole: -72.8453 -106.0531 -81.6768
quadrupole: -2.8892 2.7406 -1.5948
quadrupole: 14.0131 -19.1947 5.1816 -2.8892 2.7406 -1.5948
hfenergy: -764.8293629 hartree
pointgroup: C01 [X(C8H16O6)]
dipole: -0.7978254 0.3767521 0.6857909 debye
polarizability: 131.8528284|2.299444|108.6823162|0.8023839|0.1712862|83.6046923 unknown
InChI: InChI=1S/C8H16O6/c1-2-13-8-7(12)6(11)5(10)4(3-9)14-8/h4-12H,2-3H2,1H3
charge 0 multiplicity 1
30 atoms
O  -0.290511 0.957868 -0.27459
O  -2.163238 -0.485787 -0.20151
O  2.227266 -2.390975 -0.370976
O  3.380506 0.214193 0.266185
O  -0.515405 -2.685692 0.641417
O  0.588799 3.626163 0.119443
C  1.453116 -1.328062 0.265366
C  1.986966 0.046956 -0.201755
C  -0.022399 -1.523294 -0.096422
C  1.080812 1.213777 0.234828
C  -0.849094 -0.283764 0.312957
C  1.481944 2.56901 -0.355723
C  -3.181088 0.471558 0.299345
C  -4.538627 -0.006554 -0.209181
H  1.545158 -1.386334 1.377052
H  2.08229 0.038291 -1.301674
H  -0.119152 -1.655981 -1.193535
H  1.047662 1.289552 1.347969
H  -0.858155 -0.171035 1.425846
H  1.470436 2.496726 -1.463767
H  2.49382 2.848568 -0.02372
H  3.187035 -2.160989 -0.254116
H  3.381413 0.288397 1.256909
H  -1.449724 -2.844796 0.348679
H  -3.143489 0.488454 1.409643
H  -2.936653 1.481011 -0.080844
H  -0.336184 3.342256 -0.101545
H  -5.334679 0.683396 0.124561
H  -4.547054 -0.040774 -1.311958
H  -4.768074 -1.016241 0.172617
