program: Gaussian 09
title: 000121651
version: EM64L-G09RevD.01
frameworkgroup: C1[X(C16H21NO2)]
method: RPBEPBE
basis: SDD
operation: Freq
keyword: #p
keyword: freq=noraman
keyword: PBEPBE/SDD
title: #p freq=noraman PBEPBE/SDD
converged: YES YES NO NO
title: Mulliken charges:
elementType: O O N C C C C C C C C C C C C C C C C H H H H H H H H H H H H H H H H H H H H H
charge: -0.303459 -0.237161 -0.056713 0.235632 -0.155458 -0.533110 -0.482662 -0.585450 -0.419797 0.274968 0.289828 -0.634666 -0.383351 -0.392590 -0.253885 -0.248528 0.277544 -0.498228 -0.659824 0.225449 0.262084 0.223630 0.229598 0.218482 0.237257 0.225605 0.212419 0.215528 0.188752 0.221446 0.226448 0.248053 0.233340 0.225347 0.225466 0.239531 0.237218 0.228219 0.212909 0.230129
chargesum: 0.00000
title: Mulliken charges with hydrogens summed into heavy atoms:
elementType: O O N C C C C C C C C C C C C C C C C
charge: -0.303459 -0.237161 -0.056713 0.235632 0.069991 -0.047396 -0.034582 -0.122588 0.008150 0.274968 0.289828 0.001980 -0.135299 -0.159250 -0.028538 -0.023062 0.277544 -0.021479 0.011433
polarizability: 1.95486828e+02 -2.49726753e+00 1.84717186e+02 -1.65612213e+01 1.31747350e-01 1.46502569e+02
1716.lowfreq: -19.3670 -5.1032 0.0003 0.0005 0.0007 8.8171 14.2129 49.6102 59.9589
frequency: -18.9673 49.5530 59.8904 66.8573 95.2211 120.1567 142.6612 186.7003 210.6534 221.2327 232.2135 250.4317 264.4141 269.8080 299.6503 315.8317 324.5872 377.3177 388.7300 399.1093 451.1146 483.0577 496.3394 530.4023 539.3806 547.7540 571.0738 612.0990 647.7300 681.2577 698.9283 733.5114 755.2511 767.0548 790.9517 797.7159 828.0695 861.4074 870.1055 882.8100 906.3013 937.1865 953.0906 962.0441 971.5810 989.0052 1013.1335 1033.9198 1040.2036 1056.2766 1070.5570 1077.0922 1080.2000 1082.0480 1109.1104 1121.3405 1123.7284 1139.0174 1148.7834 1157.1466 1174.6378 1189.1289 1205.8135 1216.2430 1239.3519 1240.8189 1243.1459 1277.6624 1291.4521 1304.6285 1318.1072 1329.8858 1336.7438 1341.7549 1359.1118 1376.6975 1379.5530 1397.1028 1433.8015 1440.0181 1442.7557 1443.9511 1451.7798 1464.5444 1470.2217 1473.3052 1481.1184 1482.7574 1485.3473 1496.7590 1588.0463 1614.1325 1644.8826 2859.8453 2874.8306 2963.3428 2994.5726 2999.0117 2999.4181 3003.9321 3008.8005 3013.9267 3018.9342 3028.0008 3041.4866 3068.5436 3074.9000 3095.3462 3099.1794 3102.3893 3111.7669 3126.0027 3140.2684 3159.4629
redmass: 1.8922 3.3809 3.4712 5.4152 5.3317 3.5101 3.0038 1.1619 3.3839 1.3249 2.3934 3.1032 3.8373 2.9710 4.0113 2.9095 3.2145 2.3330 3.0830 3.2640 2.8090 2.9564 4.3027 4.3655 2.8804 3.0074 4.2199 3.6759 4.3767 5.8255 3.4343 2.6835 3.1289 1.4931 1.3613 4.1523 4.0078 2.0082 1.5258 2.1799 2.1298 2.3611 2.4042 1.5304 2.6177 1.3192 1.8423 2.2586 2.1319 2.1849 1.7618 2.6866 2.0489 1.7933 1.5729 1.8684 1.9594 2.2002 2.3315 1.3843 1.0666 1.5298 2.1420 2.5354 1.5284 1.2054 1.4575 1.6679 1.7750 1.7954 1.5568 1.6464 1.6433 1.5992 1.2878 2.0524 2.7579 1.2141 1.1756 2.0793 1.0862 1.1537 1.1179 1.0769 1.0396 1.1264 1.0514 1.3322 1.5766 1.0702 6.9230 6.4614 9.6964 1.0581 1.0697 1.0629 1.0557 1.0423 1.0815 1.0676 1.0727 1.0975 1.0793 1.0637 1.0987 1.1006 1.1038 1.1002 1.1031 1.1003 1.0871 1.0871 1.0935 1.1005
irintensity: 0.2229 1.3861 1.3003 2.0594 0.5431 0.3700 2.1629 0.1316 1.9290 0.1882 2.3832 2.3419 1.5160 4.1789 6.8210 1.4124 8.7524 0.5852 2.5362 4.1712 8.7613 6.5641 0.7440 0.9198 0.0839 3.3839 3.6611 1.2693 3.3683 3.6374 10.1596 13.6477 0.7498 54.1430 14.1020 7.2290 10.8035 4.1571 1.5876 0.4131 0.6410 19.2171 29.1133 2.3069 26.3513 0.0118 60.1796 34.8188 36.3935 50.8251 50.3731 96.5080 3.3017 2.5320 32.6767 88.1522 48.6207 57.9042 77.6170 5.6694 1.5765 4.8611 0.9818 3.1094 9.4682 1.6587 2.4432 15.9099 15.3583 6.5046 14.2249 72.7047 1.4081 2.6133 3.0628 7.1223 0.7392 19.3017 8.7406 0.8776 29.5809 13.6087 17.3641 16.7306 12.5626 5.1425 15.0409 7.3442 22.6336 7.8989 2.6680 3.3166 127.7941 77.1159 114.2566 17.5210 29.1073 20.3582 41.2156 23.8197 57.8838 16.4374 54.9921 38.7487 5.0491 31.5590 28.9546 30.9529 12.2300 31.5347 9.5886 3.0664 27.7261 32.2979
temp: 298.150 k
press: 1.00000 atm
elementType: 8 8 7 6 6 6 6 6 6 6 6 6 6 6 6 6 6 6 6 1 1 1 1 1 1 1 1 1 1 1 1 1 1 1 1 1 1 1 1 1
symmnumber: 1
zpe: 886504.8 jmol-1
zpe.correction: 0.337652 hartree
zpe.thermalcorrener: 0.354422 hartree
zpe.thermalcorrenthalpy: 0.355366 hartree
zpe.thermalcorrgfe: 0.294086 hartree
zpe.sumelectzpe: -826.079770 hartree
zpe.sumelectthermal: -826.063000 hartree
zpe.sumelectthermalent: -826.062056 hartree
zpe.sumelectthermalfe: -826.123336 hartree
dipole: 1.2621 -0.2928 1.1868
dipole: 1.7570
quadrupole: -102.6221 -110.4163 -113.7246
quadrupole: 2.5075 -8.3026 1.7948
quadrupole: 6.2989 -1.4953 -4.8036 2.5075 -8.3026 1.7948
hfenergy: -826.4174218 hartree
pointgroup: C01 [X(C16H21N1O2)]
dipole: -0.5082275 -0.0793541 -0.4617785 debye
polarizability: 195.4759663|1.6192243|184.4121483|-17.002168|0.9615587|146.8184682 unknown
InChI: InChI=1S/C16H21NO2/c1-3-15(18)19-16-8-9-17(2)13(11-16)10-12-6-4-5-7-14(12)16/h4-7,13H,3,8-11H2,1-2H3
charge 0 multiplicity 1
40 atoms
O  1.502653 -1.102081 -0.697783
O  2.410705 -0.3548 1.336006
N  -2.680579 -1.543392 -0.048024
C  0.08564 -0.712354 -0.343891
C  -1.888581 -1.085609 1.126998
C  -0.403512 -1.454562 0.914787
C  -0.726168 -1.217671 -1.563352
C  -1.982993 0.435812 1.47144
C  -2.236325 -0.986959 -1.347105
C  -0.049361 0.804598 -0.194347
C  -1.072536 1.33646 0.639072
C  -4.139645 -1.472706 0.135603
C  0.76775 1.680965 -0.949167
C  -1.233921 2.743485 0.706423
C  0.599602 3.077977 -0.869553
C  -0.408444 3.614067 -0.034154
C  2.54705 -0.878914 0.209105
C  3.855678 -1.372472 -0.396371
C  5.062614 -1.159575 0.533686
H  -2.27349 -1.652045 1.997266
H  0.189576 -1.159021 1.795105
H  -0.310512 -2.543703 0.758705
H  -0.526046 -2.297272 -1.686481
H  -0.392718 -0.693661 -2.477199
H  -1.715349 0.557576 2.54145
H  -3.032566 0.779159 1.381977
H  -2.467029 0.102928 -1.442146
H  -2.797208 -1.502095 -2.150241
H  -4.555058 -0.433689 0.137733
H  -4.417302 -1.950892 1.092583
H  -4.64026 -2.026927 -0.679741
H  1.546067 1.259751 -1.59541
H  -2.019687 3.157435 1.351294
H  1.246611 3.743715 -1.45152
H  -0.549788 4.698511 0.035174
H  3.728433 -2.442307 -0.650877
H  3.999371 -0.853981 -1.364179
H  4.925378 -1.69441 1.488948
H  5.986247 -1.529219 0.054166
H  5.194403 -0.090523 0.772622
