program: Gaussian 09
title: 000121633
version: EM64L-G09RevD.01
frameworkgroup: C1[X(C13H15N3O2S2)]
method: RPBEPBE
basis: SDD
operation: Freq
keyword: #p
keyword: freq=noraman
keyword: PBEPBE/SDD
title: #p freq=noraman PBEPBE/SDD
converged: YES YES NO NO
title: Mulliken charges:
elementType: S S O O N N N C C C C C C C C C C C C C H H H H H H H H H H H H H H H
charge: 0.290498 0.406190 -0.214184 -0.217196 -0.062442 -0.001155 0.078095 -0.359477 -0.356093 -0.395053 -0.391377 -0.399844 -0.470648 0.417333 -0.716453 -0.207903 -0.067536 -0.273719 -0.228205 -0.094534 0.223433 0.168848 0.167308 0.215449 0.212006 0.193356 0.194286 0.211789 0.188669 0.217671 0.230328 0.191357 0.286731 0.265722 0.296750
chargesum: 0.00000
title: Mulliken charges with hydrogens summed into heavy atoms:
elementType: S S O O N N N C C C C C C C C C C C C C
charge: 0.290498 0.406190 -0.214184 -0.217196 -0.062442 -0.001155 0.078095 0.032804 0.026664 0.010308 0.014698 0.006496 -0.048964 0.417333 -0.429722 -0.207903 -0.067536 -0.007997 0.068544 -0.094534
polarizability: 4.12064882e+02 3.78340128e+01 2.33760883e+02 -2.70713476e+01 1.93387326e+01 1.27229686e+02
1716.lowfreq: -26.1552 -6.1844 -0.0016 0.0006 0.0015 6.1035 10.4012 19.6160 32.5765
frequency: -22.1276 18.7814 32.2066 59.3409 63.5924 70.7043 92.2670 129.6456 162.7972 182.7858 222.4788 226.9710 246.4083 267.2399 284.7334 290.4980 315.3078 368.3774 371.3449 430.3279 433.2068 446.4809 451.4075 484.6073 526.4483 552.1277 571.5686 602.6436 626.9474 656.0392 673.5421 689.6509 701.8269 730.0329 751.7510 784.4568 799.8769 804.8168 819.0508 830.4808 852.3626 855.3333 902.2026 934.4533 936.2155 956.6687 980.0837 995.9123 1020.3002 1045.4760 1081.7104 1097.2668 1099.4498 1122.1917 1138.1327 1148.6747 1153.5203 1178.7938 1192.2076 1224.5668 1238.5367 1250.9877 1262.0632 1269.7531 1287.2220 1310.6424 1326.9913 1335.0616 1336.9131 1341.5231 1348.8243 1350.5936 1362.2063 1385.7562 1449.2349 1451.1074 1456.6635 1459.7585 1464.3818 1467.0236 1476.7872 1487.0329 1496.7535 1562.9399 2809.2233 2821.6181 2854.0243 2966.6064 2988.5893 2989.1339 3024.0710 3026.8727 3032.6205 3036.7581 3049.3885 3058.2746 3176.4830 3213.2164 3236.1895
redmass: 3.2337 4.7405 6.7984 10.6337 6.9270 5.9291 10.3606 3.8302 8.6130 7.5013 2.7648 4.3593 4.0395 3.3118 4.1780 6.2450 2.4806 4.0188 1.9292 9.0978 4.3274 2.9986 4.5618 7.6435 2.8941 2.3335 5.9151 5.4285 8.1452 8.7645 10.0415 6.2044 5.2284 11.7943 2.1170 2.1938 2.9297 1.7032 1.3192 6.6548 2.2313 1.6346 2.2587 1.4041 4.4564 1.3015 2.0552 2.4602 2.2025 2.1271 1.3779 2.7519 2.2183 2.4543 1.6034 1.3639 2.0402 1.7808 2.2806 2.0678 3.5717 1.6290 1.2967 1.3986 1.3764 2.7806 1.2695 3.3153 1.6124 1.4471 3.6137 1.9214 1.4502 1.4477 1.0956 1.1307 5.5860 1.0888 1.0865 1.0967 1.0998 6.9456 6.6006 8.1472 1.0715 1.0707 1.0707 1.0631 1.0614 1.0615 1.0861 1.0894 1.0870 1.0947 1.1035 1.1036 1.0936 1.0986 1.0958
irintensity: 0.3075 0.1030 0.8794 0.0983 0.7601 0.5239 0.3024 3.1021 5.0077 0.8647 0.2416 0.6373 0.1839 0.8106 0.3005 0.1160 1.9398 0.5881 5.3797 5.7058 1.5727 1.1098 3.0086 0.3566 3.2756 3.1692 8.9700 5.5534 3.6755 0.5269 18.6562 0.2427 1.0272 4.7691 24.7021 22.0613 3.9697 4.9227 58.8292 56.7013 1.6828 12.0269 1.3984 2.2475 15.1194 4.5668 22.5466 26.7478 5.4064 8.2170 10.3633 29.6132 37.5566 4.5113 24.8070 6.0227 12.4653 39.9234 179.7385 1.1686 612.5064 7.4802 3.2562 21.5899 6.1633 52.7913 12.7861 75.0613 0.9254 0.6685 37.5744 15.5127 17.3474 6.2183 11.0064 9.0884 65.3529 14.3452 1.0057 25.8373 5.0154 162.8108 5.4098 22.9825 64.0098 216.9839 198.4990 46.1186 29.4720 30.4128 64.1786 40.3462 21.4106 43.8565 19.2897 98.3725 1.7624 2.6736 3.3867
temp: 298.150 k
press: 1.00000 atm
elementType: 16 16 8 8 7 7 7 6 6 6 6 6 6 6 6 6 6 6 6 6 1 1 1 1 1 1 1 1 1 1 1 1 1 1 1
symmnumber: 1
zpe: 694732.0 jmol-1
zpe.correction: 0.264609 hartree
zpe.thermalcorrener: 0.282361 hartree
zpe.thermalcorrenthalpy: 0.283305 hartree
zpe.thermalcorrgfe: 0.216635 hartree
zpe.sumelectzpe: -1613.608422 hartree
zpe.sumelectthermal: -1613.590670 hartree
zpe.sumelectthermalent: -1613.589726 hartree
zpe.sumelectthermalfe: -1613.656397 hartree
dipole: 6.3449 5.3819 0.3936
dipole: 8.3293
quadrupole: -145.6455 -132.9058 -130.6924
quadrupole: -18.8150 -4.3981 0.6764
quadrupole: -9.2310 3.5088 5.7222 -18.8150 -4.3981 0.6764
hfenergy: -1613.8730313 hartree
pointgroup: C01 [X(C13H15N3O2S2)]
dipole: 2.4858091 -1.946458 -0.8779111 debye
polarizability: 414.9288235|-34.9416969|215.5520024|-5.5934218|46.0705381|142.5746253 unknown
InChI: InChI=1S/C13H15N3O2S2/c17-16(18)12-5-4-11(20-12)13-14-10(9-19-13)8-15-6-2-1-3-7-15/h4-5,9H,1-3,6-8H2
charge 0 multiplicity 1
35 atoms
S  -0.260783 -2.955128 -1.004185
S  -2.446077 0.605844 0.824191
O  -6.378113 1.192346 0.3958
O  -4.733738 2.376957 1.483488
N  3.269549 0.257571 0.271656
N  0.309521 -0.81554 0.506681
N  -5.148851 1.377502 0.764708
C  3.823132 -0.001169 -1.07913
C  4.202405 1.038424 1.122161
C  4.162296 1.319264 -1.800602
C  4.547158 2.388708 0.46248
C  5.130047 2.175961 -0.953204
C  2.782678 -0.967826 0.945347
C  1.513501 -1.499902 0.320111
C  1.411295 -2.657041 -0.446483
C  -0.720632 -1.400508 -0.093555
C  -2.080456 -0.926481 -0.067847
C  -3.228355 -1.483852 -0.653109
C  -4.414411 -0.730657 -0.418496
C  -4.171812 0.406745 0.348896
H  3.075568 -0.569391 -1.663123
H  4.748911 -0.635873 -1.014993
H  5.153074 0.469992 1.309279
H  3.718658 1.208067 2.102207
H  3.223509 1.880088 -1.971149
H  4.603238 1.091881 -2.790218
H  5.263873 2.936818 1.103683
H  3.623459 2.994666 0.394817
H  6.109991 1.659865 -0.876443
H  5.316647 3.14932 -1.444601
H  2.559131 -0.709719 1.997034
H  3.551142 -1.782288 0.957833
H  2.20427 -3.350949 -0.718833
H  -3.210036 -2.410361 -1.232638
H  -5.408291 -0.991931 -0.784461
