program: Gaussian 09
title: 000121611
version: EM64L-G09RevD.01
frameworkgroup: C1[X(C9H16N4O3S2)]
method: RPBEPBE
basis: SDD
operation: Freq
keyword: #p
keyword: freq=noraman
keyword: PBEPBE/SDD
title: #p freq=noraman PBEPBE/SDD
converged: NO YES NO NO
title: Mulliken charges:
elementType: S S O O O N N N N C C C C C C C C C H H H H H H H H H H H H H H H H
charge: 0.893724 0.354900 -0.537281 -0.537230 -0.284134 -0.165080 0.016953 -0.211598 -0.383074 -0.566743 -0.311483 -0.345628 -0.296427 -0.683676 -0.020152 -0.634938 0.289972 -0.594789 0.280103 0.280280 0.232709 0.232900 0.203407 0.203528 0.217534 0.222636 0.217491 0.296847 0.247925 0.248063 0.409862 0.256925 0.221334 0.245140
chargesum: 0.00000
title: Mulliken charges with hydrogens summed into heavy atoms:
elementType: S S O O O N N N N C C C C C C C C C
charge: 0.893724 0.354900 -0.537281 -0.537230 -0.284134 -0.165080 0.016953 -0.211598 0.026788 -0.006360 0.154126 0.061307 -0.296427 -0.026014 -0.020152 0.157897 0.289972 0.128608
polarizability: 3.00445006e+02 -3.23621773e+00 1.81312689e+02 -3.38792975e-01 4.80550270e-01 1.15213837e+02
1716.lowfreq: -47.7316 -17.2331 -3.6828 -0.0009 -0.0008 0.0009 4.7504 10.8369 22.6855
frequency: -47.7168 -14.7873 22.1509 35.0032 44.6388 65.1866 74.3290 93.7158 99.1048 109.0373 137.8068 140.1135 152.8998 180.3199 203.0918 215.5846 220.6915 223.4915 243.7170 262.6689 280.9610 306.7395 346.5398 372.1177 381.1160 398.3501 415.6081 468.1245 523.3354 532.9069 575.3699 578.0799 606.3993 646.2406 701.9198 726.8707 748.0183 786.5077 803.4079 842.8424 850.3281 890.7243 894.2805 898.8800 941.1437 1018.2271 1025.4652 1034.4646 1065.2033 1071.4645 1079.6501 1101.4188 1123.2990 1127.4138 1158.9158 1180.3417 1199.6752 1221.2584 1227.7107 1250.2205 1273.2951 1295.8028 1306.3611 1344.6414 1382.8061 1395.6610 1404.9972 1405.4157 1434.8422 1460.9694 1471.2165 1474.0483 1478.8466 1479.3123 1489.1048 1491.0295 1493.7131 1517.3388 1569.0051 1677.7732 2975.5497 2980.1093 2985.1751 2988.8457 2995.4033 3021.7112 3054.8142 3059.3264 3073.9309 3074.1485 3079.5928 3080.1935 3113.9142 3121.6987 3147.7214 3208.1270
redmass: 1.0207 5.9672 3.0659 4.7311 9.0788 6.8227 1.8141 6.9683 5.6151 2.2508 6.6639 4.7310 4.4942 3.9310 1.1129 4.7687 2.7403 5.1330 1.2684 6.6082 5.0833 6.4326 6.0883 9.5049 3.7503 4.4479 8.5275 9.2314 6.5811 12.7164 6.2809 11.1260 10.1497 10.7186 10.1763 5.1110 1.0707 1.2081 17.6141 1.1628 3.4099 1.9647 1.9009 10.5684 2.1454 5.6368 3.7725 10.4538 2.6905 1.2500 2.2445 2.2338 1.2960 1.2818 2.0037 5.1997 1.5402 3.2142 1.2123 3.2831 1.2080 1.0615 1.3033 1.4311 10.6504 1.2068 1.1632 1.2610 1.1632 1.0443 1.0629 1.0625 1.0419 1.0667 1.0510 1.0875 1.0426 4.7624 1.4349 8.1851 1.0581 1.0368 1.0343 1.0364 1.0589 1.1014 1.0558 1.1042 1.0998 1.1022 1.1014 1.0996 1.1021 1.0985 1.1108 1.0858
irintensity: 0.0443 3.4068 0.5670 0.4833 0.4115 1.3944 0.2661 7.7555 3.0864 0.1856 0.4928 5.7978 26.0221 0.0389 0.5758 6.5321 0.0679 6.8697 0.0207 1.2716 1.6708 22.1205 45.7735 4.5296 14.5321 25.4679 18.2945 131.1892 24.6273 2.9777 0.2778 0.0335 14.4815 5.4562 12.9347 3.9343 9.5342 0.5731 93.4662 100.9355 53.4670 22.9968 8.5098 16.6414 57.1054 16.0213 3.1965 1.6088 5.8187 8.3129 162.6865 38.9321 6.7383 1.2666 40.6049 103.5019 1.1808 173.8155 4.1224 118.5983 0.3473 0.8903 13.0845 16.0169 16.7033 5.4965 2.7930 57.1936 6.9682 18.1755 18.8081 4.3564 13.7733 0.2773 11.9540 19.8208 22.9519 528.4355 484.8697 322.7370 23.9762 36.2784 28.6480 56.9949 18.6721 7.9803 9.2901 4.6950 5.4442 36.8185 62.5615 39.9791 16.3863 2.4824 1.9440 440.2945
temp: 298.150 k
press: 1.00000 atm
elementType: 16 16 8 8 8 7 7 7 7 6 6 6 6 6 6 6 6 6 1 1 1 1 1 1 1 1 1 1 1 1 1 1 1 1
symmnumber: 1
zpe: 674284.3 jmol-1
zpe.correction: 0.256821 hartree
zpe.thermalcorrener: 0.276804 hartree
zpe.thermalcorrenthalpy: 0.277748 hartree
zpe.thermalcorrgfe: 0.206301 hartree
zpe.sumelectzpe: -1591.762218 hartree
zpe.sumelectthermal: -1591.742235 hartree
zpe.sumelectthermalent: -1591.741291 hartree
zpe.sumelectthermalfe: -1591.812738 hartree
dipole: -0.0732 4.0656 0.0086
dipole: 4.0663
quadrupole: -125.9885 -119.2618 -129.5478
quadrupole: 16.3660 0.1523 -0.0613
quadrupole: -1.0558 5.6709 -4.6151 16.3660 0.1523 -0.0613
hfenergy: -1592.0190391 hartree
pointgroup: C01 [X(C9H16N4O3S2)]
dipole: 0.0311135 -1.59945 0.0107437 debye
polarizability: 300.4528868|-3.0587203|181.2976697|0.6137641|-0.7868421|115.2209759 unknown
InChI: InChI=1S/C9H16N4O3S2/c1-4-5-6-18(15,16)9-12-11-8(17-9)13(3)7(14)10-2/h10H,4-6H2,1-3H3
charge 0 multiplicity 1
34 atoms
S  -2.405639 1.235995 -0.00989
S  0.771228 2.040152 -0.006693
O  -2.730647 2.000208 1.395903
O  -2.72696 1.974279 -1.43025
O  5.4706 -0.117753 0.010054
N  3.264729 0.729379 0.00462
N  -0.141958 -0.479602 0.004082
N  1.250288 -0.612816 0.006986
N  3.693655 -1.636761 0.011699
C  -3.253357 -0.521869 0.004581
C  -4.765784 -0.311859 -0.003479
C  -5.505897 -1.676921 0.003785
C  -0.540416 0.775893 -0.002674
C  -7.039085 -1.491734 -0.001097
C  1.903121 0.576098 0.00245
C  3.836786 2.095194 -0.002566
C  4.236821 -0.387109 0.013672
C  4.568763 -2.815934 0.016907
H  -2.857764 -0.989065 0.920005
H  -2.850704 -1.007339 -0.898134
H  -5.068751 0.277438 0.883434
H  -5.061042 0.26356 -0.902037
H  -5.203475 -2.258642 0.897499
H  -5.199267 -2.270034 -0.880953
H  -7.370012 -0.937906 -0.899179
H  -7.556295 -2.468246 0.004653
H  -7.374229 -0.925162 0.887418
H  4.931181 1.981884 -0.000129
H  3.521757 2.653927 0.897302
H  3.524803 2.643332 -0.909937
H  2.657451 -1.722974 0.018335
H  5.387054 -2.69126 -0.712421
H  3.971725 -3.702028 -0.252687
H  5.026225 -2.978425 1.010643
