program: Gaussian 09
title: 000121600
version: EM64L-G09RevD.01
frameworkgroup: C1[X(C18H12Cl3P)]
method: RPBEPBE
basis: SDD
operation: Freq
keyword: #p
keyword: freq=noraman
keyword: PBEPBE/SDD
title: #p freq=noraman PBEPBE/SDD
converged: YES YES NO NO
title: Mulliken charges:
elementType: Cl Cl Cl P C C C C C C C C C C C C C C C C C C H H H H H H H H H H H H
charge: -0.057494 -0.057301 -0.057453 0.656578 -0.199371 -0.202131 -0.200174 -0.168825 -0.166515 -0.166298 -0.273223 -0.273410 -0.273860 -0.114983 -0.115314 -0.115303 -0.201700 -0.201587 -0.201945 -0.236659 -0.236253 -0.236908 0.285666 0.285684 0.285435 0.250008 0.250289 0.250184 0.237696 0.237757 0.237768 0.259915 0.259906 0.259822
chargesum: 0.00000
title: Mulliken charges with hydrogens summed into heavy atoms:
elementType: Cl Cl Cl P C C C C C C C C C C C C C C C C C C
charge: -0.057494 -0.057301 -0.057453 0.656578 -0.199371 -0.202131 -0.200174 0.116841 0.119169 0.119138 -0.023215 -0.023122 -0.023675 -0.114983 -0.115314 -0.115303 0.035995 0.036170 0.035822 0.023257 0.023653 0.022913
polarizability: 2.59677682e+02 -4.74787027e-01 2.59067207e+02 -2.16445726e-01 3.41602585e-01 2.16450894e+02
1716.lowfreq: -6.4136 -1.4471 0.0009 0.0019 0.0027 8.2528 12.7014 13.7902 19.9611
frequency: 11.7639 13.6882 19.8337 39.5693 40.8696 48.3121 134.5557 135.9351 143.9429 176.9284 177.4899 182.4523 215.8643 216.1945 233.5608 276.8865 324.0653 324.6325 376.3621 383.4110 383.9462 417.4145 417.8265 418.4454 438.9362 439.1467 439.2220 539.3040 539.7335 545.5383 643.0253 649.0014 649.4679 686.1654 686.6537 688.9630 733.1900 735.8725 736.5660 786.6945 788.1260 788.5125 893.2501 894.1888 906.5992 910.7464 911.5371 912.8684 979.0397 979.2571 979.6588 980.0222 980.1432 980.3654 1061.2867 1061.3827 1065.1348 1078.6585 1080.8923 1082.3925 1102.0199 1102.5271 1107.7483 1179.0231 1179.3591 1180.0378 1277.3043 1280.0118 1281.2218 1363.0848 1365.9458 1366.6248 1395.3189 1397.2576 1398.4235 1445.3504 1445.5593 1446.0099 1563.8266 1564.3030 1564.7194 1584.2088 1584.6282 1587.5194 3132.3815 3132.9646 3133.0734 3152.9957 3153.1616 3153.3899 3158.2521 3159.7270 3161.8580 3175.0124 3176.2159 3176.2823
redmass: 8.7683 9.2600 10.7976 6.6499 6.7488 7.6807 9.3012 9.4751 6.6413 5.7247 5.6534 5.0786 4.8679 4.8911 5.9123 6.8406 5.5330 5.4780 10.4859 12.4346 12.3617 5.0321 4.8303 4.8753 4.0179 4.3788 4.4482 5.7767 5.7590 6.0736 7.1333 7.2313 7.2231 2.5210 2.5396 2.5505 8.6223 8.4278 8.4383 1.3904 1.3888 1.3852 1.3892 1.3863 1.3615 1.3612 1.3598 1.3495 2.5101 2.7063 2.4093 2.1701 1.7906 2.0088 4.1308 4.0821 3.7950 1.7123 1.7219 1.6989 1.9017 1.8927 2.0148 1.0888 1.0899 1.0927 1.2619 1.2636 1.2559 7.3641 7.8870 8.3779 2.7947 2.7402 2.7538 2.1114 2.0947 2.1311 6.2800 6.3324 6.4515 6.7251 6.7623 6.7794 1.0879 1.0878 1.0878 1.0932 1.0932 1.0932 1.0922 1.0921 1.0921 1.0981 1.0977 1.0978
irintensity: 0.3849 0.3470 0.3938 0.5002 0.4986 0.5133 0.2077 0.2450 0.6062 0.7705 0.7508 0.0787 2.1451 2.1759 0.4228 0.7069 0.0829 0.1017 13.2863 9.2982 9.1403 1.1163 0.1335 0.4823 6.8095 10.6865 11.9524 7.2947 7.1289 2.0771 8.1216 7.6512 7.7962 29.0244 29.5012 27.9904 39.3791 17.1854 18.3761 51.2209 47.2936 47.9758 8.4978 8.9138 1.0566 0.2223 0.2023 1.2707 1.8936 4.0851 6.7418 4.5214 3.0363 2.7964 13.7890 15.2061 60.5916 12.4092 10.9585 10.1233 26.7572 26.4215 17.8246 1.4451 1.4213 0.9488 4.6860 4.3504 3.8816 2.7216 3.3993 3.1670 43.1221 16.9539 18.7114 34.9518 33.8708 42.6768 58.1171 31.4705 28.8250 35.3158 34.9111 1.8119 1.9091 1.8074 2.6123 10.8141 12.2671 11.5640 3.2025 2.0972 1.3239 10.1690 12.9704 5.1522
temp: 298.150 k
press: 1.00000 atm
elementType: 17 17 17 15 6 6 6 6 6 6 6 6 6 6 6 6 6 6 6 6 6 6 1 1 1 1 1 1 1 1 1 1 1 1
symmnumber: 1
zpe: 627996.6 jmol-1
zpe.correction: 0.239191 hartree
zpe.thermalcorrener: 0.259442 hartree
zpe.thermalcorrenthalpy: 0.260386 hartree
zpe.thermalcorrgfe: 0.185387 hartree
zpe.sumelectzpe: -2413.008821 hartree
zpe.sumelectthermal: -2412.988570 hartree
zpe.sumelectthermalent: -2412.987626 hartree
zpe.sumelectthermalfe: -2413.062625 hartree
dipole: -0.0028 -0.0319 -3.4458
dipole: 3.4459
quadrupole: -147.1411 -146.8146 -159.6479
quadrupole: -0.1355 -0.1522 0.1055
quadrupole: 4.0600 4.3866 -8.4467 -0.1355 -0.1522 0.1055
hfenergy: -2413.2480123 hartree
pointgroup: C01 [X(C18H12Cl3P1)]
dipole: -0.0315647 0.0083213 1.3553406 debye
polarizability: 258.9825947|0.4697462|259.70647|1.2656117|-0.9604348|216.5067181 unknown
InChI: InChI=1S/C18H12Cl3P/c19-13-4-1-7-16(10-13)22(17-8-2-5-14(20)11-17)18-9-3-6-15(21)12-18/h1-12H
charge 0 multiplicity 1
34 atoms
Cl 3.24233 2.553791 -2.235704
Cl 0.636896 -4.039461 -2.249303
Cl -3.769314 1.456031 -2.418675
P  -0.061954 0.041441 1.675493
C  1.609891 0.408512 0.868161
C  -0.532734 -1.589246 0.837745
C  -1.191541 1.266509 0.777898
C  1.759526 1.236165 -0.272279
C  0.153849 -2.117075 -0.284148
C  -1.948293 0.928037 -0.371205
C  2.76033 -0.156653 1.478692
C  -1.611676 -2.317011 1.404964
C  -1.297224 2.572022 1.32577
C  3.053991 1.477835 -0.772164
C  -0.255655 -3.358438 -0.808894
C  -2.790265 1.901803 -0.942785
C  4.045554 0.089593 0.947066
C  -2.010516 -3.552994 0.849624
C  -2.138463 3.533842 0.723686
C  4.206272 0.917823 -0.188513
C  -1.329419 -4.090865 -0.267483
C  -2.900911 3.205023 -0.421795
H  0.889627 1.687278 -0.758652
H  0.991831 -1.578337 -0.736501
H  -1.889096 -0.072416 -0.809636
H  2.650787 -0.784351 2.370287
H  -2.134976 -1.919269 2.281784
H  -0.725932 2.833836 2.22357
H  4.928354 -0.354116 1.419352
H  -2.846707 -4.107295 1.288683
H  -2.211419 4.540667 1.148257
H  5.197243 1.124137 -0.602756
H  -1.622126 -5.051888 -0.699896
H  -3.56306 3.938672 -0.89054
