program: Gaussian 09
title: 000121536
version: EM64L-G09RevD.01
frameworkgroup: C1[X(C15H26O)]
method: RPBEPBE
basis: SDD
operation: Freq
keyword: #pfreq=noraman
keyword: PBEPBE/SDD
title: #p freq=noraman PBEPBE/SDD
converged: NO YES NO NO
title: Mulliken charges:
elementType: O C C C C C C C C C C C C C C C H H H H H H H H H H H H H H H H H H H H H H H H H H
charge: -0.467842 -0.113167 -0.037104 0.324778 0.263057 -0.418194 -0.500646 -0.452352 -0.431420 -0.470295 -0.529913 -0.766219 -0.774464 0.421769 -0.782615 -0.829697 0.169584 0.171137 0.240294 0.173444 0.200854 0.219010 0.188400 0.227608 0.198694 0.192020 0.226739 0.211625 0.210376 0.204589 0.209743 0.232466 0.211287 0.220788 0.216533 0.212315 0.239553 0.202114 0.321877 0.218615 0.227831 0.216827
chargesum: 0.00000
title: Mulliken charges with hydrogens summed into heavy atoms:
elementType: O C C C C C C C C C C C C C C C
charge: -0.145964 0.056417 0.134033 0.324778 0.263057 -0.004456 -0.080782 -0.036345 -0.040706 -0.243557 -0.107912 -0.119421 -0.125855 0.421769 -0.128631 -0.166425
polarizability: 1.74538774e+02 -6.41977308e+00 1.65289845e+02 3.01812270e-01 -6.26030661e+00 1.37493756e+02
1716.lowfreq: -8.2567 -0.0006 0.0004 0.0006 8.2373 19.7885 70.3378 91.1924 100.6326
frequency: 70.2313 91.0682 100.6105 121.0215 164.2138 168.3878 191.3977 220.1365 232.4019 240.4010 253.1649 265.8904 272.7336 291.2394 298.3345 305.2012 314.7389 338.4339 356.4969 373.6450 404.4311 421.4385 435.1461 443.1761 471.7050 489.1896 516.1401 545.0517 618.0711 637.0682 717.5695 759.8515 784.9968 789.8846 803.6600 845.7097 862.5489 871.6842 894.0674 922.5186 933.1782 941.3972 957.3112 982.7863 989.4157 990.3399 1013.1721 1023.9491 1028.7139 1046.3832 1063.9342 1075.3747 1090.0023 1121.3886 1131.4279 1136.0589 1154.3670 1167.3820 1168.2198 1178.6423 1200.4848 1227.0910 1229.4600 1254.4757 1260.2855 1287.7303 1302.9926 1311.6263 1316.2569 1324.3486 1343.8149 1344.3604 1356.4426 1363.8624 1367.0775 1376.0519 1380.9948 1393.3081 1394.6216 1396.7585 1447.9321 1450.8263 1456.8227 1461.5747 1462.8791 1465.6875 1467.2795 1470.9727 1471.3446 1476.2010 1481.6014 1488.7024 1496.2301 1686.5652 2893.7240 2938.9471 2952.7961 2955.2310 2961.3443 2967.4293 2971.1514 2976.7730 2979.4356 2987.2165 2993.3572 3001.4037 3021.6298 3024.1347 3039.9019 3050.0498 3060.1330 3064.1862 3065.0690 3066.7007 3071.4171 3075.1379 3087.3716 3087.7941 3090.4191 3533.5890
redmass: 3.0706 2.5318 2.8726 2.3344 1.8410 1.6587 1.3489 1.3858 1.2635 1.9198 1.7264 1.8454 2.2164 1.3232 2.3487 1.8989 2.6271 2.6241 2.5276 2.8425 2.8554 2.3154 2.6362 2.7459 3.0573 2.4644 2.9700 2.3551 3.7258 3.2035 2.7308 2.3301 2.9370 1.8850 2.0901 1.9163 2.1653 1.8347 1.8215 1.6466 2.0635 1.9395 1.8257 1.5499 1.5801 2.0430 1.7468 1.5370 1.7108 1.9265 1.7968 2.2593 1.8255 1.9779 2.2666 2.5457 1.5411 1.9286 1.6910 2.0216 1.7773 1.6765 1.3803 1.5781 1.3991 1.4167 1.3400 1.5521 1.4176 1.4492 1.2978 1.3700 1.4839 1.4467 1.6013 1.2053 1.3087 1.2447 1.4129 1.2356 1.0797 1.0826 1.0699 1.0477 1.0792 1.0563 1.0540 1.0736 1.0673 1.0772 1.0599 1.0696 1.0623 6.7617 1.0813 1.0625 1.0817 1.0380 1.0637 1.0365 1.0382 1.0552 1.0434 1.0921 1.0626 1.0666 1.0997 1.0965 1.0983 1.0981 1.0990 1.0965 1.0970 1.0986 1.0968 1.0978 1.0963 1.0977 1.0912 1.0656
irintensity: 0.3783 0.0550 0.2328 1.8608 2.2957 0.5333 0.2153 0.2502 0.0793 0.5798 0.2698 0.7172 27.1340 67.4171 10.2006 37.5372 2.6989 5.4383 0.9361 12.3610 4.8985 3.6590 2.0280 9.5876 3.0921 2.1390 1.6522 4.7352 3.9142 2.6249 0.3706 1.6337 1.8707 10.4766 5.7642 7.7077 4.8588 17.9123 9.8839 2.6875 6.2724 2.2876 0.0953 11.6369 4.5361 1.8236 3.7094 20.1219 5.6185 4.4908 3.4964 4.5928 35.7396 2.4755 17.8408 5.1837 7.8117 5.9673 7.4324 1.7499 1.5672 8.1154 14.5740 14.9733 4.4400 8.4619 4.0190 5.6695 0.3059 4.5274 0.4278 5.5238 2.7314 2.7766 8.4177 17.5551 23.7793 12.5032 0.9067 23.2699 3.9892 7.6677 2.1472 12.3958 5.9232 1.2382 5.5619 11.3583 10.3563 9.0347 15.5879 24.2060 9.7056 1.4466 33.7198 40.0331 28.4744 74.4387 22.4613 51.1157 18.7581 16.7204 61.2039 24.3541 50.7120 62.9209 12.2982 28.4436 10.9473 40.1460 9.3625 90.1719 45.4969 10.3165 57.6973 23.6760 19.0980 18.3759 77.8093 4.4868
temp: 298.150 k
press: 1.00000 atm
elementType: 8 6 6 6 6 6 6 6 6 6 6 6 6 6 6 6 1 1 1 1 1 1 1 1 1 1 1 1 1 1 1 1 1 1 1 1 1 1 1 1 1 1
symmnumber: 1
zpe: 988295.5 jmol-1
zpe.correction: 0.376422 hartree
zpe.thermalcorrener: 0.393654 hartree
zpe.thermalcorrenthalpy: 0.394598 hartree
zpe.thermalcorrgfe: 0.334488 hartree
zpe.sumelectzpe: -661.105291 hartree
zpe.sumelectthermal: -661.088060 hartree
zpe.sumelectthermalent: -661.087115 hartree
zpe.sumelectthermalfe: -661.147225 hartree
dipole: 1.0544 -1.5007 0.2745
dipole: 1.8545
quadrupole: -103.6251 -98.3568 -98.6024
quadrupole: 0.7203 -1.8814 0.7879
quadrupole: -3.4303 1.8379 1.5924 0.7203 -1.8814 0.7879
hfenergy: -661.4817133 hartree
pointgroup: C01 [X(C15H26O1)]
dipole: -0.4270687 -0.5808138 -0.1123496 debye
polarizability: 174.8130204|6.1488987|164.9917669|0.7759722|6.3347118|137.5175882 unknown
InChI: InChI=1S/C15H26O/c1-11-6-7-12-13(10-11)14(2,3)8-5-9-15(12,4)16/h10,12-13,16H,5-9H2,1-4H3
charge 0 multiplicity 1
42 atoms
O  2.258625 -0.496489 1.587287
C  0.193809 -0.96463 0.272166
C  -0.387541 0.41766 0.73452
C  0.049223 1.785353 0.036012
C  1.744096 -1.143824 0.334075
C  1.581161 1.861555 -0.261894
C  -0.461564 -1.441898 -1.050063
C  2.568409 -0.498873 -0.805364
C  2.121804 0.886006 -1.33316
C  -1.907472 0.288621 0.7653
C  -1.977012 -1.671472 -0.833517
C  -0.760871 2.097545 -1.254099
C  -0.254385 2.92771 1.054284
C  -2.631713 -0.634245 0.071801
C  2.105095 -2.648026 0.429443
C  -4.144496 -0.706767 0.166761
H  -0.187923 -1.666444 1.052767
H  -0.043755 0.539662 1.784307
H  2.140525 1.713393 0.680363
H  1.781153 2.900344 -0.598394
H  -0.000644 -2.383111 -1.40484
H  -0.303606 -0.693444 -1.845359
H  2.602583 -1.210829 -1.65346
H  3.601033 -0.4284 -0.412736
H  1.367553 0.76073 -2.132584
H  2.999099 1.346078 -1.829673
H  -2.45163 1.006691 1.395474
H  -2.142039 -2.677479 -0.388759
H  -2.50357 -1.691784 -1.81037
H  -0.397987 3.043973 -1.699763
H  -0.677493 1.311571 -2.023602
H  -1.835022 2.213139 -1.026466
H  -0.0145 3.913193 0.611595
H  -1.31933 2.946499 1.349235
H  0.355522 2.811497 1.970227
H  1.756331 -3.215936 -0.451597
H  3.200758 -2.763226 0.502658
H  1.649514 -3.107621 1.328615
H  1.810908 -0.932116 2.358617
H  -4.616349 -0.542595 -0.822924
H  -4.548316 0.046117 0.866156
H  -4.477486 -1.706426 0.51226
