program: Gaussian 09
title: 000121520
version: EM64L-G09RevD.01
frameworkgroup: C1[X(C4H5ClFNO3S)]
method: RPBEPBE
basis: SDD
operation: Freq
keyword: #p
keyword: freq=noraman
keyword: PBEPBE/SDD
title: #p freq=noraman PBEPBE/SDD
converged: YES YES NO NO
title: Mulliken charges:
elementType: Cl S F O O O N C C C C H H H H H
charge: 0.128652 0.255905 -0.092589 -0.108757 -0.150083 -0.127020 0.148929 -0.115769 -0.569554 -0.004504 -0.653432 0.289314 0.290792 0.236345 0.234976 0.236796
chargesum: 0.00000
title: Mulliken charges with hydrogens summed into heavy atoms:
elementType: Cl S F O O O N C C C C
charge: 0.128652 0.255905 -0.092589 -0.108757 -0.150083 -0.127020 0.148929 -0.115769 0.010552 -0.004504 0.054685
polarizability: 1.22734531e+02 -5.21693812e+00 8.41588648e+01 -1.61229089e+00 -1.09303877e+01 7.24791382e+01
1716.lowfreq: -6.5696 -3.2961 -0.0036 -0.0028 -0.0017 6.6716 21.1478 27.4086 42.5635
frequency: 21.0515 27.3715 42.5473 71.7992 102.9763 149.7723 181.7604 201.5305 240.6558 241.0478 302.1798 315.1458 355.8062 385.0104 435.7713 516.9757 603.0598 612.8997 626.6442 716.7823 764.1755 772.2960 786.2280 982.5390 997.4766 1048.6606 1068.4742 1092.5356 1189.7210 1238.0656 1281.8504 1403.9713 1445.8788 1450.8577 1472.1792 1480.9652 1619.8144 2993.4729 3044.3965 3087.5985 3092.4876 3126.0515
redmass: 3.5224 11.6448 9.7749 2.7006 5.2165 9.7436 13.7354 9.4236 1.1442 9.0393 13.1055 5.1923 18.0186 15.2592 14.4970 13.4449 6.8682 12.6588 8.8091 14.1014 12.7912 1.2093 7.2489 5.1773 2.1974 1.2271 2.7226 6.5762 14.8895 1.2154 1.2575 1.2000 1.1008 12.5390 1.0382 1.0479 12.6025 1.0360 1.0587 1.0980 1.1020 1.1077
irintensity: 0.1479 0.1048 0.5497 1.5704 0.3028 4.0524 0.3356 5.5394 0.0839 1.0901 1.0484 1.8319 5.2150 0.2026 3.9728 0.9575 5.5438 31.4201 1.5894 76.8192 174.7005 17.1133 49.2266 35.6856 12.3007 1.2742 18.7388 72.4273 91.4172 0.3437 27.6179 20.5412 7.0830 150.6492 17.2326 10.7642 154.7703 20.3088 3.6627 16.6448 9.7502 18.1982
temp: 298.150 k
press: 1.00000 atm
elementType: 17 16 9 8 8 8 7 6 6 6 6 1 1 1 1 1
symmnumber: 1
zpe: 248766.3 jmol-1
zpe.correction: 0.094750 hartree
zpe.thermalcorrener: 0.107570 hartree
zpe.thermalcorrenthalpy: 0.108514 hartree
zpe.thermalcorrgfe: 0.052332 hartree
zpe.sumelectzpe: -1392.840773 hartree
zpe.sumelectthermal: -1392.827953 hartree
zpe.sumelectthermalent: -1392.827009 hartree
zpe.sumelectthermalfe: -1392.883190 hartree
dipole: -4.0390 -0.8782 -0.5741
dipole: 4.1730
quadrupole: -64.7053 -82.5133 -82.9000
quadrupole: -3.6274 -1.3529 1.8416
quadrupole: 12.0009 -5.8071 -6.1938 -3.6274 -1.3529 1.8416
hfenergy: -1392.9355227 hartree
pointgroup: C01 [X(C4H5Cl1F1N1O3S1)]
dipole: -1.6179608 0.1318064 0.2455638 debye
dipolederiv: -0.3714065 -0.2690502 0.0315184 -0.2765252 -0.3858227 -0.0093019 0.0385731 0.0092585 -0.0714832 -0.6702071 -0.237992 0.1161039 -0.3296543 -0.2082742 0.111945 0.1637216 0.0983447 -0.0824628 -0.3687173 -0.0343712 -0.0044609 -0.0860785 -0.2734642 0.1384977 0.081676 0.104864 -0.677302 -0.4433122 0.0884764 -0.0632052 -0.3001302 -0.7078729 0.303845 0.199612 0.4376218 -0.4126748 -0.3087434 0.1545945 -0.0404044 0.1777426 -0.3360978 -0.0815753 -0.0921088 -0.0526287 -0.7066498 -0.426148 0.2868716 -0.1433619 0.4377231 -0.5182529 0.089992 -0.0857239 -0.0081361 -0.4326481 0.4413082 -0.5943744 0.2039977 -0.7718408 0.7677681 0.0121651 0.1005471 0.1744971 1.0460071 0.71623 0.5136971 -0.0253353 0.5938019 0.7688313 -0.1040738 -0.108325 -0.1654121 0.8302834 0.5790248 -0.0024642 0.0988221 -0.0900883 0.0740993 0.0363668 0.1825946 0.0513932 0.1338433 1.0075821 0.1196878 -0.1548617 0.5414932 0.7049769 -0.4818129 -0.3399331 -0.6063568 0.2924674 -0.1709844 -0.0712012 0.0070741 0.0735658 0.0539542 0.0171035 -0.1196325 -0.0136471 0.0486393 -0.03979 -0.0238402 -0.0146779 0.0229017 -0.0745857 -0.0234273 -0.0639445 -0.0221252 0.0635913 -0.0591854 -0.0178004 0.0389654 0.0294429 0.0741875 0.0200857 0.0009509 -0.0024124 -0.0693632 0.114821 0.0633404 0.0188265 -0.0162753 -0.1106066 -0.0534304 0.0357522 -0.0477351 0.0893506 0.117942 0.0005185 0.0107766 -0.0261439 0.0928727 -0.0258055 0.0888377 -0.0063778 -0.1182059 -0.1184137 0.0239076 -0.0797774 0.0200653 0.0782869 0.0494264 -0.0825975 0.048852 0.0666075 unknown
polarizability: 120.8163019|9.8001579|86.6559013|2.7625467|-10.3791286|71.9003313 unknown
InChI: InChI=1S/C4H5ClFNO3S/c1-2-11-3(8)4(5,6)7(9)10/h2H2,1H3
charge 0 multiplicity 1
16 atoms
Cl 2.195717 1.838027 0.273201
S  -1.564126 -0.502623 0.67989
F  1.126034 -0.107279 1.753521
O  -0.638842 1.611385 -0.802153
O  1.419717 -0.723703 -1.720836
O  2.46638 -1.633857 0.101812
N  1.723531 -0.783815 -0.482211
C  1.090711 0.377042 0.433918
C  -3.099716 0.126869 -0.262368
C  -0.360425 0.678331 -0.027899
C  -4.311373 -0.723827 0.131909
H  -3.216307 1.188614 0.00627
H  -2.858604 0.057606 -1.335016
H  -4.169891 -1.786159 -0.132071
H  -4.525172 -0.657775 1.212863
H  -5.200934 -0.356237 -0.41133
