program: Gaussian 09
title: 000121557
version: EM64L-G09RevD.01
frameworkgroup: C1[X(C13H20O4)]
method: RPBEPBE
basis: SDD
operation: Freq
keyword: #pfreq=noraman
keyword: PBEPBE/SDD
title: #p freq=noraman PBEPBE/SDD
converged: YES YES NO NO
title: Mulliken charges:
elementType: O O O O C C C C C C C C C C C C C H H H H H H H H H H H H H H H H H H H H
charge: -0.306484 -0.293643 -0.488220 -0.442982 -0.533431 0.552866 -0.361804 0.245726 -0.116513 -0.523478 -0.299082 0.176793 -0.458875 -0.325960 -0.300653 -0.685044 -0.525745 0.202610 0.200999 0.210426 0.211463 0.225348 0.207208 0.225446 0.259122 0.233404 0.242835 0.189975 0.204467 0.210959 0.210388 0.220538 0.376164 0.244486 0.215529 0.232059 0.363104
chargesum: 0.00000
title: Mulliken charges with hydrogens summed into heavy atoms:
elementType: O O O O C C C C C C C C C C C C C
charge: -0.306484 -0.293643 -0.112056 -0.079879 -0.129822 0.552866 0.060085 0.245726 0.108836 -0.264355 0.133571 0.176793 -0.225471 -0.083125 0.093789 -0.043159 0.166329
polarizability: 2.22708558e+02 6.75182108e+00 1.55230401e+02 8.86514502e+00 -3.62165546e+00 1.03965484e+02
1716.lowfreq: -6.9066 -0.0004 -0.0004 0.0005 1.9040 10.6794 22.1842 26.8745 43.2952
frequency: 21.8703 26.8677 43.2163 58.8584 68.0474 82.9453 91.3674 108.4564 136.5512 140.0412 163.0327 178.2440 201.9867 219.1943 231.1541 276.1103 286.6084 315.6284 320.6447 378.5795 398.7925 436.2987 453.1477 472.4975 479.5603 505.3167 522.8881 550.8934 604.8897 641.8950 708.7313 738.3783 746.5627 758.8370 807.1278 834.0085 863.9782 873.3819 895.7142 908.0401 923.4900 933.8790 955.2696 987.4379 1000.4759 1035.9604 1051.2865 1071.3365 1076.7834 1095.4006 1099.3392 1110.2420 1113.2329 1156.4122 1161.1297 1161.3477 1201.5863 1213.4972 1221.8108 1243.8002 1251.8510 1265.7933 1283.2863 1286.5446 1291.6153 1322.3940 1339.1677 1358.5983 1375.7087 1385.9730 1390.7425 1400.6798 1404.4028 1440.0176 1454.4637 1457.9763 1466.0038 1470.2542 1476.5920 1477.6002 1481.9324 1489.1106 1491.8557 1581.4752 1614.7437 2953.9901 2965.5861 2971.0162 2971.7822 2974.0562 2981.3131 2982.9128 3016.2811 3035.9381 3042.2260 3071.1251 3071.6909 3074.2909 3076.0890 3121.2937 3128.1580 3142.7107 3158.2639 3524.3552 3558.1973
redmass: 3.3819 4.3763 3.9893 4.1032 3.7570 1.9253 3.1281 3.7468 2.8390 2.4024 1.4864 3.8125 3.9614 3.8611 1.1268 3.3241 3.1997 3.3906 3.5625 4.6022 4.3498 1.1250 4.3516 2.4718 3.3906 1.1593 3.9332 3.9139 4.4990 4.3222 5.2544 2.8680 1.1977 4.6997 1.4973 3.2234 1.5922 1.6917 2.6187 1.7520 1.4275 1.3640 7.2254 3.8448 4.9076 2.3352 2.8876 1.4711 1.9750 2.1424 2.8238 2.3259 1.3001 1.3493 1.4934 1.2630 1.8344 1.1567 1.3967 1.1675 2.9375 1.3629 1.2403 1.3042 1.5312 1.2773 1.4945 1.3694 2.4035 1.7452 1.2163 1.4719 2.3243 1.4044 1.1060 1.0610 1.1027 1.0807 1.0560 1.0475 1.0569 1.0889 2.7493 7.2719 6.8394 1.0683 1.0565 1.0339 1.0492 1.0450 1.0830 1.0602 1.0996 1.1067 1.1033 1.1013 1.1002 1.0992 1.0959 1.1030 1.0884 1.0915 1.0947 1.0650 1.0658
irintensity: 0.0504 0.5756 1.2836 0.6450 4.9564 0.0861 0.6079 11.0623 6.0436 0.7834 1.0966 2.9898 2.0169 1.7496 0.0357 2.4507 2.4982 7.3010 1.4977 5.6509 2.1234 176.1923 3.8378 12.8469 9.3201 176.0568 9.2622 16.0510 8.6464 7.0637 1.2920 5.4882 6.2214 19.5383 38.8784 48.4152 3.2840 7.7158 4.1319 7.0929 5.4014 1.3030 130.9958 37.0139 33.8706 120.2434 0.7487 5.3682 22.4015 17.9841 4.9074 100.2208 5.9289 8.4339 5.2163 12.2792 105.7938 0.5988 0.4801 81.3704 158.4041 5.0735 6.3291 26.4639 7.3960 32.6873 1.6153 9.7433 18.1448 24.7381 10.2192 18.4254 13.6807 7.4049 28.2146 15.8386 19.9934 0.3573 3.6358 9.1850 8.3757 16.2310 161.4548 14.6550 7.2272 31.9887 47.2191 77.2943 7.7969 44.7437 48.2473 64.4303 0.7158 34.8389 13.6050 75.7891 34.9609 46.1181 40.4772 22.8028 15.0745 8.5558 12.7556 16.6986 19.1516
temp: 298.150 k
press: 1.00000 atm
elementType: 8 8 8 8 6 6 6 6 6 6 6 6 6 6 6 6 6 1 1 1 1 1 1 1 1 1 1 1 1 1 1 1 1 1 1 1 1
symmnumber: 1
zpe: 810135.8 jmol-1
zpe.correction: 0.308564 hartree
zpe.thermalcorrener: 0.327796 hartree
zpe.thermalcorrenthalpy: 0.328740 hartree
zpe.thermalcorrgfe: 0.258952 hartree
zpe.sumelectzpe: -806.900009 hartree
zpe.sumelectthermal: -806.880778 hartree
zpe.sumelectthermalent: -806.879834 hartree
zpe.sumelectthermalfe: -806.949621 hartree
dipole: -3.2484 -1.0294 1.6847
dipole: 3.8013
quadrupole: -123.7630 -94.2128 -104.7053
quadrupole: 2.2248 0.0655 2.0014
quadrupole: -16.2027 13.3476 2.8551 2.2248 0.0655 2.0014
hfenergy: -807.2085737 hartree
pointgroup: C01 [X(C13H20O4)]
dipole: 1.274543 -0.3383651 -0.7054509 debye
polarizability: 223.3891021|-4.8355417|154.4875082|5.8864522|6.0022058|104.0278326 unknown
InChI: InChI=1S/C13H20O4/c1-3-4-10-5-6-12(13(7-10)16-2)17-9-11(15)8-14/h5-7,11,14-15H,3-4,8-9H2,1-2H3
charge 0 multiplicity 1
37 atoms
O  -1.542162 0.155819 -0.349826
O  0.127394 2.308079 0.332921
O  -4.028601 0.233375 0.951252
O  -6.273121 -0.815511 -0.22801
C  4.148633 -0.609734 0.364398
C  2.647531 -0.443452 0.183225
C  4.961485 -0.192233 -0.893903
C  -0.161927 -0.101065 -0.210001
C  -3.855523 -0.401129 -0.368314
C  2.042177 0.834434 0.303276
C  -2.452282 -0.9972 -0.486403
C  0.660376 1.021068 0.107887
C  1.818368 -1.540856 -0.148563
C  0.427516 -1.377022 -0.346111
C  -4.975383 -1.450024 -0.441332
C  6.48244 -0.358927 -0.693342
C  -0.536554 2.949161 -0.821852
H  4.49811 -0.003402 1.223916
H  4.385343 -1.665155 0.603172
H  4.624158 -0.797965 -1.757956
H  4.72694 0.861673 -1.142446
H  -4.002361 0.355927 -1.167222
H  -2.303816 -1.492744 -1.467454
H  -2.265478 -1.719782 0.333083
H  2.637116 1.716385 0.566791
H  2.257926 -2.54005 -0.250164
H  -0.185949 -2.249256 -0.592444
H  -4.787358 -2.240179 0.317901
H  -5.020533 -1.909082 -1.443367
H  6.842262 0.260245 0.150187
H  6.741378 -1.41134 -0.470186
H  7.04287 -0.057617 -1.597138
H  -3.276533 0.863608 1.094353
H  -1.391667 2.347339 -1.175118
H  0.187042 3.098068 -1.64687
H  -0.883153 3.925278 -0.449463
H  -6.172966 -0.238834 0.575423
