program: Gaussian 09
title: 000121562
version: EM64L-G09RevD.01
frameworkgroup: C1[X(C22H28N2O3)]
method: RPBEPBE
basis: SDD
operation: Freq
keyword: #p
keyword: freq=noraman
keyword: PBEPBE/SDD
title: #p freq=noraman PBEPBE/SDD
converged: YES YES NO NO
title: Mulliken charges:
elementType: O O O N N C C C C C C C C C C C C C C C C C C C C C C H H H H H H H H H H H H H H H H H H H H H H H H H H H H
charge: -0.267370 -0.214177 -0.213605 -0.086011 0.026808 0.241624 -0.538403 -0.518780 -0.386670 -0.480050 0.477012 -0.373200 -0.378263 -0.558048 -0.574694 -0.411981 -0.697589 0.298989 -0.224226 0.533592 -0.378043 -0.379292 -0.394978 -0.361048 -0.356317 0.366573 -0.537596 0.216892 0.242700 0.194570 0.241432 0.195204 0.228023 0.192154 0.197669 0.197061 0.227638 0.212327 0.227099 0.236309 0.228272 0.227210 0.268953 0.208634 0.206304 0.220667 0.222739 0.250997 0.245230 0.247402 0.283935 0.284275 0.218281 0.246005 0.217759
chargesum: 0.00000
title: Mulliken charges with hydrogens summed into heavy atoms:
elementType: O O O N N C C C C C C C C C C C C C C C C C C C C C C
charge: -0.267370 -0.214177 -0.213605 -0.086011 0.026808 0.241624 -0.078810 -0.082777 0.036558 -0.090227 0.477012 0.051499 0.061163 -0.321739 -0.119211 -0.143028 -0.061985 0.298989 -0.001487 0.533592 -0.127046 -0.134063 -0.147576 -0.077112 -0.072042 0.366573 0.144449
polarizability: 4.44107583e+02 -1.68356136e+01 2.15055962e+02 2.16653704e+01 2.90419740e+01 2.17410907e+02
1716.lowfreq: -0.0011 -0.0008 -0.0002 2.6577 2.7488 8.8280 13.9108 15.5635 19.0425
frequency: 13.8216 15.3586 19.0021 25.0529 46.7023 50.3990 65.0505 69.6013 80.7981 93.5119 98.0961 117.6782 127.6102 139.9657 166.2147 184.2642 212.0679 212.3790 224.6809 243.2925 270.9598 275.3927 294.2797 306.0102 311.5149 333.6874 343.3935 355.8639 357.5916 389.7769 409.1384 438.3449 447.4809 470.3949 502.7817 507.5609 533.1328 545.7400 584.3173 602.4263 628.3496 649.0799 663.9856 673.9063 682.4103 706.3710 734.4361 744.1658 769.5968 790.1664 796.5209 808.2211 822.2882 830.7268 850.6917 855.2694 857.9294 867.4020 874.2624 892.6400 895.2371 917.9747 966.3221 973.5386 985.0308 985.1699 993.3929 995.1771 1002.4532 1005.2844 1014.6754 1020.0673 1040.1222 1050.6244 1063.9482 1076.4656 1093.2799 1101.9068 1112.7168 1114.0452 1118.2237 1126.8183 1144.4063 1156.2184 1161.7492 1173.5528 1179.3843 1180.7587 1187.9781 1209.1384 1217.2491 1220.7477 1222.8921 1229.9834 1240.0941 1275.6212 1279.6607 1285.5003 1287.6634 1291.7521 1302.2211 1305.7534 1318.8198 1329.5070 1345.6747 1355.1785 1362.2332 1376.3716 1384.0282 1387.0247 1402.4898 1418.4555 1418.6537 1444.0745 1464.9185 1465.9601 1467.5958 1470.6394 1472.2588 1475.1709 1476.6289 1480.7236 1483.6081 1486.1949 1486.4432 1492.2387 1501.4368 1593.6155 1598.9340 1603.6305 1607.5219 2829.6072 2864.8160 2925.9843 2954.2653 2962.4642 2970.1348 2978.9046 2989.8992 2997.4477 3000.4133 3006.2850 3012.1540 3021.1118 3034.9670 3040.1257 3065.9545 3067.2692 3072.6082 3073.0725 3121.6134 3131.3510 3135.4950 3139.0485 3149.2529 3162.5971 3172.3242 3180.6051 3183.0210
redmass: 4.7155 5.5755 5.0453 5.0246 5.5578 3.7158 4.1483 5.6495 2.4045 1.8188 3.2260 5.0946 3.3949 3.9252 2.7431 3.2031 2.1721 4.3700 1.5063 2.6793 1.5726 2.7238 2.6464 2.6157 2.6363 2.9504 3.4229 3.1904 3.7459 5.3048 2.8982 3.8535 3.6462 3.1854 3.3789 6.5414 3.3739 3.7118 4.1230 5.0353 6.8869 5.0521 3.6016 4.6014 4.8524 1.9420 4.4826 1.1322 6.0030 1.2213 1.4962 2.0938 4.1410 3.7503 1.2492 1.8755 1.4801 1.6836 2.0613 1.6353 1.6962 2.1742 1.8241 1.4460 2.8301 1.6961 1.4138 1.9584 4.0769 3.0503 3.5570 1.9058 2.2012 1.9922 2.2182 1.8544 3.3343 1.7344 1.2609 1.7566 1.8184 1.7099 1.6299 1.3468 1.7578 1.3045 1.3598 1.2519 1.9894 1.8079 2.2015 4.2416 2.2628 1.8463 1.9111 1.3437 1.4217 1.2875 1.2434 1.2983 1.2676 1.3422 1.5842 1.3613 1.4606 1.5183 7.5019 1.4163 6.3117 1.2237 8.6952 3.0460 2.1242 1.4115 1.1240 1.1041 1.0620 1.1658 1.0840 1.0650 1.0467 2.3361 1.1251 1.1018 1.5359 1.1953 1.0904 7.6554 6.5800 5.9821 6.3255 1.0705 1.0715 1.0666 1.0333 1.0595 1.0364 1.0625 1.0801 1.0626 1.0781 1.0944 1.0902 1.0858 1.1014 1.1037 1.1023 1.1013 1.0991 1.1009 1.0989 1.0874 1.0903 1.0907 1.0887 1.0917 1.0977 1.0942 1.0953
irintensity: 0.0494 0.6715 0.3057 1.3634 0.8207 0.4820 1.0044 0.4378 0.9136 1.4562 7.0197 1.6487 0.7707 0.6404 5.7848 7.4868 1.2317 1.9532 1.0904 1.5757 0.5507 0.2640 0.6706 2.9873 5.5823 10.6018 0.4509 2.7541 0.2676 4.7564 0.0005 1.0378 2.4521 4.0037 14.9263 1.9239 1.2698 6.0894 1.4748 0.6503 0.2791 3.0636 2.6370 25.5514 1.9152 38.8212 9.3525 10.2654 14.3017 9.9596 40.3702 14.6386 13.0598 6.1122 0.2676 3.5109 16.3566 49.8345 10.8118 0.5800 3.9693 5.6485 7.7655 1.1788 2.4413 9.9776 0.1664 2.9331 45.4791 1.6278 59.1043 4.5711 2.0709 9.0810 13.6817 8.8470 22.9929 33.5180 0.2723 16.1105 8.2405 61.5758 48.3839 5.6494 36.8716 18.4795 106.8626 9.1761 45.5665 39.6839 85.0327 433.6214 101.4022 35.4138 7.0831 8.0326 24.0121 3.5255 1.4881 3.6271 0.3100 7.7531 7.4873 95.0867 16.2904 1.2008 96.4230 9.4781 4.6970 11.8383 1.8443 33.7014 36.2869 6.3661 19.7262 4.2091 19.5403 72.0134 4.2647 9.2828 18.8944 6.8285 7.1494 13.3689 14.9801 7.8049 25.0067 4.7741 27.6790 146.1805 88.4685 62.2898 118.2752 62.8425 55.3695 17.0430 51.2031 21.4748 29.1699 17.3919 61.2248 16.8835 40.5499 22.6370 17.4326 50.5392 19.9245 71.8241 46.3360 56.5180 31.2327 12.4896 12.6203 6.8863 11.6877 3.8628 12.0617 0.0691 4.0701
temp: 298.150 k
press: 1.00000 atm
elementType: 8 8 8 7 7 6 6 6 6 6 6 6 6 6 6 6 6 6 6 6 6 6 6 6 6 6 6 1 1 1 1 1 1 1 1 1 1 1 1 1 1 1 1 1 1 1 1 1 1 1 1 1 1 1 1
symmnumber: 1
zpe: 1199862.7 jmol-1
zpe.correction: 0.457004 hartree
zpe.thermalcorrener: 0.483533 hartree
zpe.thermalcorrenthalpy: 0.484477 hartree
zpe.thermalcorrgfe: 0.396099 hartree
zpe.sumelectzpe: -1188.192376 hartree
zpe.sumelectthermal: -1188.165846 hartree
zpe.sumelectthermalent: -1188.164902 hartree
zpe.sumelectthermalfe: -1188.253280 hartree
dipole: 6.7520 1.4032 2.1093
dipole: 7.2117
quadrupole: -227.9593 -162.2898 -155.2013
quadrupole: 14.2697 4.7194 3.7658
quadrupole: -46.1425 19.5270 26.6155 14.2697 4.7194 3.7658
hfenergy: -1188.6493793 hartree
pointgroup: C01 [X(C22H28N2O3)]
dipole: -2.6417432 -0.5807789 0.8567914 debye
polarizability: 443.0749116|-16.9911791|217.6242348|-26.8585165|-28.6587421|215.8753062 unknown
InChI: InChI=1S/C22H28N2O3/c1-3-12-22(19-5-4-6-21(16-19)27-2)13-15-23(17-22)14-11-18-7-9-20(10-8-18)24(25)26/h4-10,16H,3,11-15,17H2,1-2H3
charge 0 multiplicity 1
55 atoms
O  -6.651243 1.787282 0.478989
O  8.388798 -0.777563 0.539489
O  8.244024 0.186804 -1.523142
N  -0.203053 -0.298925 0.355983
N  7.724521 -0.188749 -0.400543
C  -2.484896 -1.075121 0.354696
C  -2.000004 -0.935616 1.842626
C  -1.114984 -1.219166 -0.366144
C  -0.685499 -0.117064 1.757476
C  -3.337519 -2.363997 0.162377
C  -3.260142 0.200015 -0.05665
C  1.231992 -0.511031 0.169355
C  -3.769133 -2.644841 -1.295131
C  -4.596026 0.373747 0.40312
C  2.054015 0.783408 0.459074
C  -2.677286 1.226046 -0.838285
C  -4.651697 -3.906018 -1.412579
C  -5.327659 1.5373 0.071324
C  -3.418521 2.386934 -1.168269
C  3.538705 0.566247 0.247567
C  -4.742231 2.55294 -0.724197
C  4.324782 -0.07775 1.242847
C  4.167312 0.952845 -0.966952
C  5.694502 -0.329964 1.041859
C  5.536323 0.711652 -1.190865
C  6.283373 0.0692 -0.178763
C  -7.311063 0.77514 1.303643
H  -1.796755 -1.945502 2.248546
H  -2.756745 -0.454731 2.485152
H  -0.785655 -2.285718 -0.293551
H  -1.16326 -0.960615 -1.440328
H  0.063682 -0.489111 2.491742
H  -0.862517 0.954805 1.971126
H  -4.24278 -2.318388 0.800846
H  -2.747132 -3.225583 0.53849
H  1.628685 -1.335116 0.818784
H  1.411121 -0.817048 -0.879018
H  -2.869351 -2.767391 -1.93047
H  -4.316772 -1.768172 -1.691065
H  -5.059561 -0.404078 1.017952
H  1.856846 1.096198 1.502141
H  1.670025 1.581715 -0.200795
H  -1.63368 1.140258 -1.152813
H  -4.121264 -4.802516 -1.038645
H  -5.581046 -3.796441 -0.821597
H  -4.941544 -4.098915 -2.461633
H  -2.953448 3.17253 -1.774605
H  -5.331124 3.442182 -0.968144
H  3.85722 -0.371993 2.189571
H  3.575025 1.453649 -1.741319
H  6.311885 -0.819313 1.799783
H  6.033199 1.008545 -2.118206
H  -7.390569 -0.193305 0.771137
H  -8.318102 1.173307 1.497163
H  -6.779973 0.625493 2.264553
