program: Gaussian 09
title: 000121549
version: EM64L-G09RevD.01
frameworkgroup: C1[X(C13H17ClN2O3)]
method: RPBEPBE
basis: SDD
operation: Freq
keyword: #p
keyword: freq=noraman
keyword: PBEPBE/SDD
title: #p freq=noraman PBEPBE/SDD
converged: YES YES NO NO
title: Mulliken charges:
elementType: Cl O O O N N C C C C C C C C C C C C C H H H H H H H H H H H H H H H H H
charge: -0.059710 -0.299461 -0.265501 -0.311227 -0.381202 -0.460205 -0.025178 -0.124772 0.233285 -0.672403 -0.709358 -0.704620 0.286998 0.505292 -0.433967 -0.368310 -0.044560 -0.185571 -0.254301 0.242408 0.256077 0.350559 0.210254 0.203099 0.254275 0.230573 0.221497 0.210059 0.221108 0.255445 0.224875 0.341603 0.255686 0.303303 0.234304 0.259647
chargesum: 0.00000
title: Mulliken charges with hydrogens summed into heavy atoms:
elementType: Cl O O O N N C C C C C C C C C C C C C
charge: -0.059710 -0.299461 -0.265501 -0.311227 -0.030643 -0.118603 0.217230 0.131305 0.233285 -0.004774 -0.047230 -0.003191 0.286998 0.505292 -0.178281 -0.065008 -0.044560 0.048733 0.005346
polarizability: 2.48247308e+02 -1.77400119e+01 1.65564598e+02 -1.30612684e+01 -2.44447129e+01 1.30357118e+02
1716.lowfreq: -14.0402 -3.4287 -0.0020 -0.0013 -0.0012 2.5332 15.1189 17.3313 33.0149
frequency: 8.2479 17.2915 32.9968 57.2287 69.6250 77.4023 99.3814 107.4011 143.1207 171.1320 183.4466 189.9697 204.5796 208.5106 240.4245 250.1075 260.3820 275.4479 299.9702 340.1055 353.9261 371.7629 405.4802 411.2328 438.9226 449.4990 494.6073 560.0413 579.4553 636.0332 651.8454 666.8791 684.1650 700.3559 708.2827 732.7991 750.1821 789.5619 813.3929 837.3770 864.0814 870.8571 876.8268 909.1381 920.6254 944.0665 958.1104 979.2848 987.6961 1001.9497 1014.5352 1072.3768 1074.0495 1097.9890 1137.1303 1143.6644 1165.0601 1175.1887 1180.4519 1182.4200 1230.8865 1248.8929 1306.4390 1309.9061 1311.4305 1328.9726 1349.1698 1377.2996 1377.6930 1394.5883 1395.3846 1414.5410 1455.3178 1462.4849 1464.5762 1467.1070 1474.1836 1475.1833 1486.7827 1508.2930 1522.2237 1588.3013 1610.4962 1619.4276 1646.7667 2977.4773 2981.8154 3007.9958 3017.6147 3024.2982 3071.1377 3081.4799 3091.7454 3096.9155 3105.2593 3123.2981 3146.1613 3148.2952 3180.5648 3198.3240 3416.1765 3538.5028
redmass: 2.9779 5.6817 4.6272 5.5263 6.0818 5.2963 6.3845 4.3978 3.7915 2.3899 4.6304 1.6214 1.2004 2.7183 1.9333 2.2223 2.7814 4.4608 4.5423 4.8980 3.9402 4.3750 3.3364 7.7435 3.0413 3.2138 2.9737 4.3418 6.3925 4.0211 1.7104 5.3446 2.3123 2.7866 6.6666 1.2972 5.2882 1.3205 4.1935 2.8726 1.5871 4.7751 3.0059 1.3658 1.2342 1.5625 1.9669 5.9567 1.3162 8.0201 1.7642 1.7240 2.0196 1.5340 2.1964 2.3681 2.1904 2.7336 1.1352 2.1729 2.0296 1.7779 1.4674 1.3628 1.3324 1.7744 1.2562 1.5676 2.8202 1.2283 1.2485 3.1669 1.0443 1.0571 1.0503 1.0447 1.6128 1.4590 1.0493 1.7332 2.2361 5.0052 6.5863 7.5614 6.6392 1.0369 1.0363 1.0364 1.0847 1.0850 1.0990 1.0992 1.0998 1.1001 1.0993 1.1007 1.0927 1.0892 1.0953 1.0954 1.0803 1.0762
irintensity: 0.5004 0.1228 0.0793 4.1544 3.4143 1.8946 7.0054 1.7729 1.8164 2.5730 0.7364 0.9699 1.0286 4.3671 2.5799 3.3607 9.9577 13.6959 3.8697 16.4681 2.5416 0.5987 4.2493 4.8667 7.7454 2.3930 8.2300 3.3494 4.1910 8.4392 21.8523 29.8594 31.2504 62.3421 8.5221 122.4756 11.9571 56.3067 83.2176 27.1099 48.4466 21.0524 0.7677 3.5829 3.5769 1.3850 5.8810 10.1821 3.5372 139.7643 50.5699 136.7579 29.4066 16.1044 46.4439 10.1806 34.3444 308.7074 21.0310 34.2674 61.7514 12.8850 23.5307 2.6838 0.1414 3.2402 1.4644 31.6442 95.4692 29.6364 33.0791 92.1702 12.3532 12.1465 5.3527 2.5807 80.9463 68.2606 23.0615 262.4531 388.2549 196.1643 335.0678 26.6720 214.2938 21.0040 22.7883 12.9481 5.0174 11.2933 11.1749 71.9800 33.0982 25.4989 20.7320 11.8652 5.8660 6.8996 2.2007 4.9951 158.6099 36.4621
temp: 298.150 k
press: 1.00000 atm
elementType: 17 8 8 8 7 7 6 6 6 6 6 6 6 6 6 6 6 6 6 1 1 1 1 1 1 1 1 1 1 1 1 1 1 1 1 1
symmnumber: 1
zpe: 746837.5 jmol-1
zpe.correction: 0.284455 hartree
zpe.thermalcorrener: 0.304547 hartree
zpe.thermalcorrenthalpy: 0.305491 hartree
zpe.thermalcorrgfe: 0.232274 hartree
zpe.sumelectzpe: -1299.431321 hartree
zpe.sumelectthermal: -1299.411230 hartree
zpe.sumelectthermalent: -1299.410286 hartree
zpe.sumelectthermalfe: -1299.483503 hartree
dipole: -0.7585 1.1564 -1.8689
dipole: 2.3250
quadrupole: -136.3043 -109.7349 -122.3082
quadrupole: 4.7455 -5.1267 0.1829
quadrupole: -13.5218 13.0476 0.4742 4.7455 -5.1267 0.1829
hfenergy: -1299.7157768 hartree
pointgroup: C01 [X(C13H17Cl1N2O3)]
dipole: -0.2553094 -0.4061101 0.7788333 debye
polarizability: 241.9900843|29.5370846|165.8931769|15.1209497|-25.8970714|136.2857631 unknown
InChI: InChI=1S/C13H17ClN2O3/c1-8(2)15-12(17)9(3)19-13(18)16-11-6-4-5-10(14)7-11/h4-9,15-16H,1-3H3
charge 0 multiplicity 1
36 atoms
Cl -5.844296 -0.536685 -1.252107
O  1.040503 1.822129 -0.123215
O  4.204915 1.465109 -1.207647
O  0.738695 0.052514 1.407847
N  3.386873 -0.195351 0.216663
N  -0.961919 0.789333 -0.070496
C  4.220064 -1.284787 -0.345275
C  2.431986 2.065766 0.41163
C  3.423473 1.086337 -0.281271
C  3.596401 -1.840816 -1.648191
C  4.412328 -2.378164 0.723569
C  2.752035 3.522284 0.11025
C  0.299833 0.806819 0.493677
C  -2.042409 -0.083099 0.232396
C  -3.230761 0.07877 -0.530307
C  -1.976647 -1.077032 1.24456
C  -4.326475 -0.757476 -0.264158
C  -3.101681 -1.895844 1.476965
C  -4.294008 -1.752995 0.730608
H  5.195817 -0.829561 -0.5989
H  2.395257 1.857006 1.4976
H  2.657506 -0.423947 0.907267
H  4.252201 -2.614165 -2.088386
H  2.60859 -2.296013 -1.447544
H  3.472413 -1.031109 -2.38728
H  4.891778 -1.970631 1.631395
H  5.050677 -3.187526 0.328306
H  3.441698 -2.82602 1.011852
H  1.977837 4.182598 0.535749
H  2.825876 3.680383 -0.977175
H  3.7292 3.784809 0.551271
H  -1.111417 1.490696 -0.799927
H  -3.296938 0.840204 -1.314832
H  -1.063435 -1.194516 1.82989
H  -3.051572 -2.662017 2.25784
H  -5.162996 -2.389504 0.91558
